id_mutation,date_mutation,numero_disposition,nature_mutation,valeur_fonciere,adresse_numero,adresse_suffixe,adresse_nom_voie,adresse_code_voie,code_postal,code_commune,nom_commune,code_departement,ancien_code_commune,ancien_nom_commune,id_parcelle,ancien_id_parcelle,numero_volume,lot1_numero,lot1_surface_carrez,lot2_numero,lot2_surface_carrez,lot3_numero,lot3_surface_carrez,lot4_numero,lot4_surface_carrez,lot5_numero,lot5_surface_carrez,nombre_lots,code_type_local,type_local,surface_reelle_bati,nombre_pieces_principales,code_nature_culture,nature_culture,code_nature_culture_speciale,nature_culture_speciale,surface_terrain,longitude,latitude
2023-344738,2023-04-26,000001,Vente,152000,,,CROCE,B071,20246,2B287,Sorio,2B,,,2B2870000B0499,,,,,,,,,,,,,0,,,,,T,terres,,,117,9.27535,42.58272
2023-344738,2023-04-26,000001,Vente,152000,5072,,CROCE,B071,20246,2B287,Sorio,2B,,,2B2870000B0500,,,,,,,,,,,,,0,1,Maison,35,3,S,sols,,,40,9.275289,42.582744
2023-345048,2023-05-20,000001,Vente,5000,,,SANT ANTONE,B238,20246,2B287,Sorio,2B,,,2B2870000C0380,,,,,,,,,,,,,0,,,,,J,jardins,,,228,9.270674,42.581898
2023-345156,2023-06-12,000001,Vente,41000,5025,,VALLE,B293,20246,2B287,Sorio,2B,,,2B2870000B0127,,,,,,,,,,,,,0,1,Maison,24,2,S,sols,,,30,9.272819,42.583416
2023-345422,2023-06-13,000001,Vente,30000,,,FASCINE,B075,20246,2B287,Sorio,2B,,,2B2870000B0459,,,,,,,,,,,,,0,,,,,T,terres,,,328,9.273832,42.583543
2023-345422,2023-06-13,000001,Vente,30000,,,FASCINE,B075,20246,2B287,Sorio,2B,,,2B2870000B0461,,,,,,,,,,,,,0,,,,,J,jardins,,,182,9.273592,42.583683
2023-345422,2023-06-13,000001,Vente,30000,,,FASCINE,B075,20246,2B287,Sorio,2B,,,2B2870000B0464,,,,,,,,,,,,,0,,,,,J,jardins,,,525,9.273505,42.583464
2023-345422,2023-06-13,000001,Vente,30000,,,CASTAGNETO,B046,20246,2B287,Sorio,2B,,,2B2870000C0037,,,,,,,,,,,,,0,,,,,VE,vergers,CHAT,Châtaigneraie,2783,9.279882,42.581369
2023-345581,2023-07-13,000001,Vente,2800,,,COSTARELLA,B070,20246,2B287,Sorio,2B,,,2B2870000B0933,,,,,,,,,,,,,0,,,,,T,terres,,,112,9.276767,42.583383
2023-346037,2023-08-03,000001,Vente,38000,,,VALLE,B293,20246,2B287,Sorio,2B,,,2B2870000B0140,,,,,,,,,,,,,0,,,,,S,sols,,,19,9.272366,42.583493
2023-346037,2023-08-03,000001,Vente,38000,5031,,VALLE,B293,20246,2B287,Sorio,2B,,,2B2870000B0141,,,,,,,,,,,,,0,1,Maison,30,3,S,sols,,,27,9.272337,42.58351
2023-346037,2023-08-03,000001,Vente,38000,5032,,VALLE,B293,20246,2B287,Sorio,2B,,,2B2870000B0142,,,1,,,,,,,,,,1,3,Dépendance,,0,,,,,,9.272299,42.583542
2023-346084,2023-08-10,000001,Vente,1020,,,GHIANDOLACCIE,B102,20246,2B287,Sorio,2B,,,2B2870000C0461,,,,,,,,,,,,,0,,,,,L,landes,FRICH,Friche,320,9.270276,42.578
2023-346084,2023-08-10,000001,Vente,1020,,,GHIANDOLACCIE,B102,20246,2B287,Sorio,2B,,,2B2870000C0462,,,,,,,,,,,,,0,,,,,VE,vergers,CHAT,Châtaigneraie,580,9.27046,42.577812
2023-346436,2023-09-20,000001,Vente,,5082,,CROCE,B071,20246,2B287,Sorio,2B,,,2B2870000B0512,,,,,,,,,,,,,0,1,Maison,17,1,S,sols,,,35,9.27523,42.582913
2023-346436,2023-09-20,000001,Vente,,5076,,CROCE,B071,20246,2B287,Sorio,2B,,,2B2870000B0504,,,,,,,,,,,,,0,1,Maison,30,3,S,sols,,,65,9.2754,42.582849
2023-346438,2023-09-20,000001,Vente,,,,CATTERO,B049,20246,2B287,Sorio,2B,,,2B2870000B0015,,,,,,,,,,,,,0,,,,,J,jardins,,,155,9.271599,42.582942
2023-346438,2023-09-20,000001,Vente,,5046,,SORBO,B256,20246,2B287,Sorio,2B,,,2B2870000B0159,,,,,,,,,,,,,0,1,Maison,30,3,S,sols,,,82,9.271832,42.58343
2023-346438,2023-09-20,000001,Vente,,,,VALLE,B293,20246,2B287,Sorio,2B,,,2B2870000B0170,,,,,,,,,,,,,0,,,,,L,landes,FRICH,Friche,5,9.271811,42.58356
2023-346438,2023-09-20,000001,Vente,,,,TIGHIETINCA,B280,20246,2B287,Sorio,2B,,,2B2870000C0281,,,,,,,,,,,,,0,,,,,J,jardins,,,73,9.269925,42.580954
2023-346438,2023-09-20,000001,Vente,,,,CAPOLANO,B038,20246,2B287,Sorio,2B,,,2B2870000E0249,,,,,,,,,,,,,0,,,,,T,terres,,,18146,9.231616,42.573649
2023-346438,2023-09-20,000001,Vente,,,,CAPOLANO,B038,20246,2B287,Sorio,2B,,,2B2870000E0250,,,,,,,,,,,,,0,,,,,BT,taillis simples,CHVER,Chênes -verts,1572,9.231301,42.573074
2023-346438,2023-09-20,000001,Vente,,,,CAPOLANO,B038,20246,2B287,Sorio,2B,,,2B2870000E0251,,,,,,,,,,,,,0,,,,,L,landes,ROC,Rocs ou rochers,761,9.231312,42.574076
