id_mutation,date_mutation,numero_disposition,nature_mutation,valeur_fonciere,adresse_numero,adresse_suffixe,adresse_nom_voie,adresse_code_voie,code_postal,code_commune,nom_commune,code_departement,ancien_code_commune,ancien_nom_commune,id_parcelle,ancien_id_parcelle,numero_volume,lot1_numero,lot1_surface_carrez,lot2_numero,lot2_surface_carrez,lot3_numero,lot3_surface_carrez,lot4_numero,lot4_surface_carrez,lot5_numero,lot5_surface_carrez,nombre_lots,code_type_local,type_local,surface_reelle_bati,nombre_pieces_principales,code_nature_culture,nature_culture,code_nature_culture_speciale,nature_culture_speciale,surface_terrain,longitude,latitude
2023-393366,2023-01-12,000001,Vente,35000,1,,CHEM DU CANAL,0025,32160,32440,Tasque,32,,,32440000ZE0039,,,,,,,,,,,,,0,,,,,T,terres,,,8431,-0.00318,43.627492
2023-393366,2023-01-12,000001,Vente,35000,1,,CHEM DU CANAL,0025,32160,32440,Tasque,32,,,32440000ZE0039,,,,,,,,,,,,,0,,,,,J,jardins,,,407,-0.00318,43.627492
2023-395756,2023-06-30,000001,Vente,1292200,,,AU PORTET,B021,32160,32440,Tasque,32,,,324400000C0344,,,,,,,,,,,,,0,,,,,P,prés,,,3150,0.029998,43.622798
2023-395756,2023-06-30,000001,Vente,1292200,,,AU PORTET,B021,32160,32440,Tasque,32,,,324400000C0345,,,,,,,,,,,,,0,,,,,BT,taillis simples,,,26185,0.029832,43.62202
2023-395756,2023-06-30,000001,Vente,1292200,,,AU PORTET,B021,32160,32440,Tasque,32,,,324400000C0346,,,,,,,,,,,,,0,,,,,P,prés,,,9985,0.029956,43.62201
2023-395756,2023-06-30,000001,Vente,1292200,,,AU PORTET,B021,32160,32440,Tasque,32,,,324400000C0347,,,,,,,,,,,,,0,,,,,J,jardins,,,3646,0.028701,43.622296
2023-395756,2023-06-30,000001,Vente,1292200,5000,,AU PORTET,B021,32160,32440,Tasque,32,,,324400000C0348,,,,,,,,,,,,,0,3,Dépendance,,0,BT,taillis simples,,,1566,0.028873,43.622688
2023-395756,2023-06-30,000001,Vente,1292200,14,,RTE DES CHATEAUX,0030,32160,32440,Tasque,32,,,324400000C0349,,,,,,,,,,,,,0,1,Maison,409,12,S,sols,,,7801,0.029211,43.623038
2023-395756,2023-06-30,000001,Vente,1292200,14,,RTE DES CHATEAUX,0030,32160,32440,Tasque,32,,,324400000C0349,,,,,,,,,,,,,0,1,Maison,90,2,S,sols,,,7801,0.029211,43.623038
2023-395756,2023-06-30,000001,Vente,1292200,,,AU PORTET,B021,32160,32440,Tasque,32,,,324400000C0351,,,,,,,,,,,,,0,,,,,BT,taillis simples,,,1155,0.028505,43.623422
2023-395756,2023-06-30,000001,Vente,1292200,,,AU PORTET,B021,32160,32440,Tasque,32,,,324400000C0402,,,,,,,,,,,,,0,,,,,BT,taillis simples,,,5787,0.028236,43.622792
2023-396182,2023-07-05,000001,Vente,289000,,,AU VILLAGE,B027,32160,32440,Tasque,32,,,324400000C0102,,,,,,,,,,,,,0,,,,,J,jardins,,,350,0.021889,43.639957
2023-396182,2023-07-05,000001,Vente,289000,,,AU VILLAGE,B027,32160,32440,Tasque,32,,,324400000C0104,,,,,,,,,,,,,0,,,,,J,jardins,,,601,0.022506,43.639522
2023-396182,2023-07-05,000001,Vente,289000,5,,QUA LE VILLAGE,A030,32160,32440,Tasque,32,,,324400000C0458,,,,,,,,,,,,,0,1,Maison,137,5,T,terres,,,4736,0.022324,43.640009
2023-396182,2023-07-05,000001,Vente,289000,5,,QUA LE VILLAGE,A030,32160,32440,Tasque,32,,,324400000C0458,,,,,,,,,,,,,0,1,Maison,137,5,S,sols,,,1000,0.022324,43.640009
2023-397445,2023-10-13,000001,Vente,119425,4,,RTE DE GALIAX,0040,32160,32440,Tasque,32,,,32440000ZD0016,,,,,,,,,,,,,0,1,Maison,60,3,S,sols,,,480,0.018501,43.63386
2023-398056,2023-12-15,000001,Vente,220015,25,,QUA LE VILLAGE,A030,32160,32440,Tasque,32,,,324400000C0035,,,,,,,,,,,,,0,1,Maison,171,5,S,sols,,,540,0.019221,43.638821
2023-398056,2023-12-15,000001,Vente,220015,,,AU VILLAGE,B027,32160,32440,Tasque,32,,,324400000C0036,,,,,,,,,,,,,0,,,,,T,terres,,,2658,0.019567,43.638415
2023-398056,2023-12-15,000001,Vente,220015,,,AU VILLAGE,B027,32160,32440,Tasque,32,,,324400000C0036,,,,,,,,,,,,,0,,,,,S,sols,,,362,0.019567,43.638415
2023-398056,2023-12-15,000001,Vente,220015,25,,QUA LE VILLAGE,A030,32160,32440,Tasque,32,,,324400000C0040,,,,,,,,,,,,,0,,,,,S,sols,,,320,0.019404,43.638924
