id_mutation,date_mutation,numero_disposition,nature_mutation,valeur_fonciere,adresse_numero,adresse_suffixe,adresse_nom_voie,adresse_code_voie,code_postal,code_commune,nom_commune,code_departement,ancien_code_commune,ancien_nom_commune,id_parcelle,ancien_id_parcelle,numero_volume,lot1_numero,lot1_surface_carrez,lot2_numero,lot2_surface_carrez,lot3_numero,lot3_surface_carrez,lot4_numero,lot4_surface_carrez,lot5_numero,lot5_surface_carrez,nombre_lots,code_type_local,type_local,surface_reelle_bati,nombre_pieces_principales,code_nature_culture,nature_culture,code_nature_culture_speciale,nature_culture_speciale,surface_terrain,longitude,latitude
2023-466233,2023-01-06,000001,Vente,294000,5569,,LA COUVRIE,C264,35140,35304,Saint-Ouen-des-Alleux,35,,,35304000ZH0251,,,,,,,,,,,,,0,1,Maison,98,3,AG,terrains d'agrément,,,658,-1.408855,48.338
2023-466233,2023-01-06,000001,Vente,294000,5569,,LA COUVRIE,C264,35140,35304,Saint-Ouen-des-Alleux,35,,,35304000ZH0251,,,,,,,,,,,,,0,1,Maison,98,3,S,sols,,,800,-1.408855,48.338
2023-466329,2023-01-09,000001,Vente,120000,1,,RUE DE L'ETANG,0016,35140,35304,Saint-Ouen-des-Alleux,35,,,35304000ZC0201,,,,,,,,,,,,,0,1,Maison,65,3,S,sols,,,691,-1.427371,48.325491
2023-466513,2023-01-19,000001,Vente,46000,,,LA CHATAIGNERAIE ROCHER CO,B264,35140,35304,Saint-Ouen-des-Alleux,35,,,35304000ZD0100,,,,,,,,,,,,,0,,,,,BT,taillis simples,,,2570,-1.435731,48.337069
2023-466513,2023-01-19,000001,Vente,46000,,,LE ROCHER COLAS,C109,35140,35304,Saint-Ouen-des-Alleux,35,,,35304000ZD0101,,,,,,,,,,,,,0,,,,,J,jardins,POTAG,Jardin potager,735,-1.435727,48.33674
2023-466513,2023-01-19,000001,Vente,46000,,,LE ROCHER COLAS,C109,35140,35304,Saint-Ouen-des-Alleux,35,,,35304000ZD0180,,,,,,,,,,,,,0,,,,,T,terres,,,433,-1.436323,48.336588
2023-466513,2023-01-19,000001,Vente,46000,5001,,LE ROCHER COLAS,C109,35140,35304,Saint-Ouen-des-Alleux,35,,,35304000ZD0182,,,,,,,,,,,,,0,1,Maison,91,2,S,sols,,,953,-1.436,48.336674
2023-466513,2023-01-19,000001,Vente,46000,,,LE ROCHER COLAS,C109,35140,35304,Saint-Ouen-des-Alleux,35,,,35304000ZD0185,,,,,,,,,,,,,0,,,,,J,jardins,POTAG,Jardin potager,720,-1.435799,48.336526
2023-467228,2023-01-16,000001,Vente,3000,,,LES COUVRIES,B419,35140,35304,Saint-Ouen-des-Alleux,35,,,35304000ZH0055,,,,,,,,,,,,,0,,,,,T,terres,,,8360,-1.40919,48.335371
2023-467228,2023-01-16,000001,Vente,3000,,,LE ROCHER COUVE,C110,35140,35304,Saint-Ouen-des-Alleux,35,,,35304000ZH0070,,,,,,,,,,,,,0,,,,,BT,taillis simples,,,1720,-1.407729,48.335715
2023-468323,2023-02-03,000003,Vente,40000,5069,,LA LANDE HILAIRE,B687,35140,35304,Saint-Ouen-des-Alleux,35,,,35304000ZH0285,,,,,,,,,,,,,0,1,Maison,32,1,,,,,,-1.392626,48.333191
2023-468323,2023-02-03,000003,Vente,40000,5069,,LA LANDE HILAIRE,B687,35140,35304,Saint-Ouen-des-Alleux,35,,,35304000ZH0285,,,,,,,,,,,,,0,3,Dépendance,,0,,,,,,-1.392626,48.333191
2023-468323,2023-02-03,000003,Vente,40000,,,LA LANDE DU BAS,B679,35140,35304,Saint-Ouen-des-Alleux,35,,,35304000ZH0287,,,,,,,,,,,,,0,,,,,P,prés,,,218,-1.392601,48.333119
2023-468371,2023-02-24,000001,Vente,249000,5001,,LE HIL,B560,35140,35304,Saint-Ouen-des-Alleux,35,,,35304000ZN0117,,,,,,,,,,,,,0,1,Maison,98,5,S,sols,,,452,-1.414114,48.326622
2023-469404,2023-03-10,000001,Vente,6000,,,LA CROIX,B421,35140,35304,Saint-Ouen-des-Alleux,35,,,35304000ZI0016,,,,,,,,,,,,,0,,,,,T,terres,,,19200,-1.402699,48.330452
2023-469404,2023-03-10,000001,Vente,6000,,,LA CROIX,B421,35140,35304,Saint-Ouen-des-Alleux,35,,,35304000ZI0118,,,,,,,,,,,,,0,,,,,J,jardins,POTAG,Jardin potager,250,-1.401876,48.331259
2023-469440,2023-02-27,000001,Vente,58000,,,LE VERGER,C229,35140,35304,Saint-Ouen-des-Alleux,35,,,35304000ZI0153,,,,,,,,,,,,,0,,,,,P,prés,,,966,-1.423522,48.328654
2023-470200,2023-03-21,000001,Vente,325000,1,,RUE DU CORBEL,0006,35140,35304,Saint-Ouen-des-Alleux,35,,,353040000D0176,,,,,,,,,,,,,0,4,Local industriel. commercial ou assimilé,70,0,S,sols,,,140,-1.425636,48.328425
2023-470200,2023-03-21,000001,Vente,325000,1,,RUE DU CORBEL,0006,35140,35304,Saint-Ouen-des-Alleux,35,,,353040000D0176,,,,,,,,,,,,,0,2,Appartement,78,3,S,sols,,,140,-1.425636,48.328425
2023-470200,2023-03-21,000001,Vente,325000,1,,RUE DU CORBEL,0006,35140,35304,Saint-Ouen-des-Alleux,35,,,353040000D0176,,,,,,,,,,,,,0,4,Local industriel. commercial ou assimilé,48,0,S,sols,,,140,-1.425636,48.328425
2023-471644,2023-04-07,000001,Vente,125000,37,,RUE DU GENERAL DE GAULLE,0003,35140,35304,Saint-Ouen-des-Alleux,35,,,353040000D0044,,,,,,,,,,,,,0,1,Maison,65,3,S,sols,,,220,-1.425244,48.328715
2023-472661,2023-03-27,000001,Vente,5500,,,LE HAUT RASSINOUX,B550,35140,35304,Saint-Ouen-des-Alleux,35,,,35304000ZI0006,,,,,,,,,,,,,0,,,,,T,terres,,,16520,-1.415495,48.33541
2023-476639,2023-06-14,000001,Vente,16500,14,,LA LOUVETAIS,B719,35140,35304,Saint-Ouen-des-Alleux,35,,,35304000ZK0127,,,,,,,,,,,,,0,1,Maison,61,3,S,sols,,,147,-1.394914,48.328249
2023-477287,2023-06-28,000001,Vente,123795,,,LA LANDELLE,B693,35140,35304,Saint-Ouen-des-Alleux,35,,,35304000ZI0159,,,,,,,,,,,,,0,,,,,T,terres,,,9170,-1.422063,48.329802
2023-478431,2023-07-21,000001,Vente,146400,,,LA BERRANGERAIS,B030,35140,35304,Saint-Ouen-des-Alleux,35,,,35304000ZH0015,,,,,,,,,,,,,0,,,,,T,terres,,,440,-1.399351,48.33586
2023-478431,2023-07-21,000001,Vente,146400,5055,,LA BERRANGERAIS,B030,35140,35304,Saint-Ouen-des-Alleux,35,,,35304000ZH0095,,,,,,,,,,,,,0,3,Dépendance,,0,S,sols,,,450,-1.399181,48.335862
2023-478431,2023-07-21,000001,Vente,146400,5055,,LA BERRANGERAIS,B030,35140,35304,Saint-Ouen-des-Alleux,35,,,35304000ZH0095,,,,,,,,,,,,,0,1,Maison,54,2,S,sols,,,450,-1.399181,48.335862
2023-478431,2023-07-21,000001,Vente,146400,,,LA BERRANGERAIS,B030,35140,35304,Saint-Ouen-des-Alleux,35,,,35304000ZH0117,,,,,,,,,,,,,0,,,,,S,sols,,,60,-1.399144,48.335921
2023-479665,2023-07-18,000001,Vente,260000,,,LA MAISON NEUVE,B721,35140,35304,Saint-Ouen-des-Alleux,35,,,35304000ZC0227,,,,,,,,,,,,,0,,,,,J,jardins,POTAG,Jardin potager,17,-1.433883,48.325744
2023-479665,2023-07-18,000001,Vente,260000,5223,,LA MAISON NEUVE,B721,35140,35304,Saint-Ouen-des-Alleux,35,,,35304000ZC0296,,,,,,,,,,,,,0,1,Maison,144,5,S,sols,,,442,-1.433908,48.325951
2023-479665,2023-07-18,000001,Vente,260000,,,LA MAISON NEUVE,B721,35140,35304,Saint-Ouen-des-Alleux,35,,,35304000ZC0298,,,,,,,,,,,,,0,,,,,T,terres,,,1797,-1.433642,48.326153
2023-479665,2023-07-18,000001,Vente,260000,,,LA MAISON NEUVE,B721,35140,35304,Saint-Ouen-des-Alleux,35,,,35304000ZC0298,,,,,,,,,,,,,0,,,,,S,sols,,,50,-1.433642,48.326153
2023-479665,2023-07-18,000001,Vente,260000,,,LA MAISON NEUVE,B721,35140,35304,Saint-Ouen-des-Alleux,35,,,35304000ZC0299,,,,,,,,,,,,,0,,,,,J,jardins,POTAG,Jardin potager,506,-1.43405,48.325746
2023-479850,2023-08-08,000001,Vente,109858,5503,,LOT LOT HLM LES LANDELLES,A010,35140,35304,Saint-Ouen-des-Alleux,35,,,353040000D0266,,,,,,,,,,,,,0,1,Maison,74,3,S,sols,,,283,-1.425193,48.330143
2023-481930,2023-09-04,000002,Vente,65000,,,LE VERGER,C229,35140,35304,Saint-Ouen-des-Alleux,35,,,35304000ZI0239,,,,,,,,,,,,,0,,,,,P,prés,,,1044,-1.423726,48.328518
2023-482244,2023-09-14,000001,Vente,112005,5286,,LA TISONNAIS,C166,35140,35304,Saint-Ouen-des-Alleux,35,,,35304000ZC0109,,,,,,,,,,,,,0,3,Dépendance,,0,S,sols,,,1330,-1.445349,48.325701
2023-482244,2023-09-14,000001,Vente,112005,5286,,LA TISONNAIS,C166,35140,35304,Saint-Ouen-des-Alleux,35,,,35304000ZC0109,,,,,,,,,,,,,0,1,Maison,80,3,S,sols,,,1330,-1.445349,48.325701
2023-482244,2023-09-14,000001,Vente,112005,5286,,LA TISONNAIS,C166,35140,35304,Saint-Ouen-des-Alleux,35,,,35304000ZC0109,,,,,,,,,,,,,0,1,Maison,70,3,S,sols,,,1330,-1.445349,48.325701
2023-482244,2023-09-14,000001,Vente,112005,5286,,LA TISONNAIS,C166,35140,35304,Saint-Ouen-des-Alleux,35,,,35304000ZC0109,,,,,,,,,,,,,0,1,Maison,70,4,S,sols,,,1330,-1.445349,48.325701
2023-482244,2023-09-14,000001,Vente,112005,,,LA TISONNAIS,C166,35140,35304,Saint-Ouen-des-Alleux,35,,,35304000ZC0418,,,,,,,,,,,,,0,,,,,P,prés,,,792,-1.445019,48.325751
2023-483031,2023-09-22,000001,Vente,158000,5480,,LOT LOT HLM LES LANDELLES,A010,35140,35304,Saint-Ouen-des-Alleux,35,,,353040000D0270,,,,,,,,,,,,,0,1,Maison,81,4,S,sols,,,331,-1.425925,48.330261
2023-483271,2023-09-12,000001,Vente,47000,,,LE ROBICHON,C102,35140,35304,Saint-Ouen-des-Alleux,35,,,353040000D0323,,,,,,,,,,,,,0,,,,,J,jardins,POTAG,Jardin potager,366,-1.427183,48.327807
2023-483271,2023-09-12,000001,Vente,47000,,,LE ROBICHON,C102,35140,35304,Saint-Ouen-des-Alleux,35,,,353040000D0325,,,,,,,,,,,,,0,,,,,T,terres,,,19,-1.42718,48.327801
2023-483271,2023-09-12,000001,Vente,47000,,,LE ROBICHON,C102,35140,35304,Saint-Ouen-des-Alleux,35,,,353040000D0326,,,,,,,,,,,,,0,,,,,T,terres,,,12,-1.427138,48.327797
2023-484283,2023-10-17,000001,Vente,112000,5484,,LOT LOT HLM LES LANDELLES,A010,35140,35304,Saint-Ouen-des-Alleux,35,,,353040000D0278,,,,,,,,,,,,,0,1,Maison,63,3,S,sols,,,257,-1.425197,48.330373
2023-484596,2023-10-04,000001,Vente,2000,,,L ILET DE BECHEREL,B564,35140,35304,Saint-Ouen-des-Alleux,35,,,353040000C0571,,,,,,,,,,,,,0,,,,,L,landes,,,380,-1.439946,48.315324
2023-484596,2023-10-04,000001,Vente,2000,,,MOULIN DE BECHEREL,B743,35140,35304,Saint-Ouen-des-Alleux,35,,,353040000C0572,,,,,,,,,,,,,0,,,,,S,sols,,,830,-1.439556,48.315006
2023-484596,2023-10-04,000002,Vente,2000,,,PRE DU BAS DES VALLEES,B984,35140,35304,Saint-Ouen-des-Alleux,35,,,353040000C0575,,,,,,,,,,,,,0,,,,,P,prés,,,2240,-1.435474,48.314011
2023-484596,2023-10-04,000002,Vente,2000,,,LE PRE DES ROCHES,B976,35140,35304,Saint-Ouen-des-Alleux,35,,,353040000C0593,,,,,,,,,,,,,0,,,,,BT,taillis simples,,,820,-1.433536,48.314303
2023-484811,2023-10-19,000001,Vente,86500,13,,RUE DU GENERAL DE GAULLE,0003,35140,35304,Saint-Ouen-des-Alleux,35,,,353040000D0026,,,,,,,,,,,,,0,1,Maison,44,1,S,sols,,,8,-1.426334,48.327857
2023-484811,2023-10-19,000001,Vente,86500,,,LE BOURG,B076,35140,35304,Saint-Ouen-des-Alleux,35,,,353040000D0150,,,,,,,,,,,,,0,,,,,S,sols,,,12,-1.426409,48.327876
2023-484811,2023-10-19,000001,Vente,86500,,,LE BOURG,B076,35140,35304,Saint-Ouen-des-Alleux,35,,,353040000D0151,,,,,,,,,,,,,0,,,,,S,sols,,,18,-1.426377,48.327865
2023-485073,2023-10-06,000001,Vente,122000,5573,,LA MAISON NEUVE,B721,35140,35304,Saint-Ouen-des-Alleux,35,,,35304000ZC0295,,,,,,,,,,,,,0,1,Maison,69,2,S,sols,,,423,-1.434116,48.325996
2023-485073,2023-10-06,000001,Vente,122000,,,LA MAISON NEUVE,B721,35140,35304,Saint-Ouen-des-Alleux,35,,,35304000ZC0297,,,,,,,,,,,,,0,,,,,S,sols,,,450,-1.434032,48.326246
2023-485073,2023-10-06,000001,Vente,122000,,,LA MAISON NEUVE,B721,35140,35304,Saint-Ouen-des-Alleux,35,,,35304000ZC0297,,,,,,,,,,,,,0,,,,,T,terres,,,5564,-1.434032,48.326246
2023-485073,2023-10-06,000001,Vente,122000,,,LA MAISON NEUVE,B721,35140,35304,Saint-Ouen-des-Alleux,35,,,35304000ZC0300,,,,,,,,,,,,,0,,,,,J,jardins,POTAG,Jardin potager,475,-1.434206,48.325681
2023-485175,2023-10-19,000001,Vente,100000,5188,,LE ROCHER POIRIER,C115,35140,35304,Saint-Ouen-des-Alleux,35,,,35304000ZM0206,,,,,,,,,,,,,0,3,Dépendance,,0,S,sols,,,760,-1.419561,48.312671
2023-485175,2023-10-19,000001,Vente,100000,5188,,LE ROCHER POIRIER,C115,35140,35304,Saint-Ouen-des-Alleux,35,,,35304000ZM0206,,,,,,,,,,,,,0,1,Maison,42,2,S,sols,,,760,-1.419561,48.312671
2023-485175,2023-10-19,000001,Vente,100000,,,LE ROCHER POIRIER,C115,35140,35304,Saint-Ouen-des-Alleux,35,,,35304000ZM0223,,,,,,,,,,,,,0,,,,,J,jardins,POTAG,Jardin potager,440,-1.419552,48.312497
2023-485437,2023-11-06,000001,Vente,8500,,,LA BASSE ANERIE,B023,35140,35304,Saint-Ouen-des-Alleux,35,,,35304000ZP0027,,,,,,,,,,,,,0,,,,,T,terres,,,19120,-1.442483,48.321985
2023-486302,2023-11-22,000001,Vente,160000,,,LE JARDIN DE LA CROIX,B580,35140,35304,Saint-Ouen-des-Alleux,35,,,35304000ZI0112,,,,,,,,,,,,,0,,,,,P,prés,,,1680,-1.402356,48.331319
2023-486302,2023-11-22,000001,Vente,160000,5413,,LA CROIX,B421,35140,35304,Saint-Ouen-des-Alleux,35,,,35304000ZI0113,,,,,,,,,,,,,0,1,Maison,75,3,S,sols,,,560,-1.40214,48.331587
2023-486302,2023-11-22,000001,Vente,160000,5413,,LA CROIX,B421,35140,35304,Saint-Ouen-des-Alleux,35,,,35304000ZI0113,,,,,,,,,,,,,0,3,Dépendance,,0,S,sols,,,560,-1.40214,48.331587
2023-486302,2023-11-22,000001,Vente,160000,5413,,LA CROIX,B421,35140,35304,Saint-Ouen-des-Alleux,35,,,35304000ZI0113,,,,,,,,,,,,,0,3,Dépendance,,0,S,sols,,,560,-1.40214,48.331587
2023-486302,2023-11-22,000001,Vente,160000,5413,,LA CROIX,B421,35140,35304,Saint-Ouen-des-Alleux,35,,,35304000ZI0113,,,,,,,,,,,,,0,3,Dépendance,,0,S,sols,,,560,-1.40214,48.331587
2023-489885,2023-12-22,000001,Echange,100,,,LE ROCHER POIRIER,C115,35140,35304,Saint-Ouen-des-Alleux,35,,,35304000ZM0225,,,,,,,,,,,,,0,,,,,J,jardins,POTAG,Jardin potager,25,-1.419512,48.312348
2023-489885,2023-12-22,000002,Echange,100,,,LE ROCHER POIRIER,C115,35140,35304,Saint-Ouen-des-Alleux,35,,,35304000ZM0221,,,,,,,,,,,,,0,,,,,S,sols,,,14,-1.419654,48.312449
