id_mutation,date_mutation,numero_disposition,nature_mutation,valeur_fonciere,adresse_numero,adresse_suffixe,adresse_nom_voie,adresse_code_voie,code_postal,code_commune,nom_commune,code_departement,ancien_code_commune,ancien_nom_commune,id_parcelle,ancien_id_parcelle,numero_volume,lot1_numero,lot1_surface_carrez,lot2_numero,lot2_surface_carrez,lot3_numero,lot3_surface_carrez,lot4_numero,lot4_surface_carrez,lot5_numero,lot5_surface_carrez,nombre_lots,code_type_local,type_local,surface_reelle_bati,nombre_pieces_principales,code_nature_culture,nature_culture,code_nature_culture_speciale,nature_culture_speciale,surface_terrain,longitude,latitude
2023-490520,2023-01-26,000001,Vente,36788.15,,,LES MARGOTTERIES,B083,36220,36076,Fontgombault,36,,,36076000ZH0010,,,,,,,,,,,,,0,,,,,T,terres,,,3872,0.942292,46.671624
2023-491408,2023-03-30,000001,Vente,145350,,,VILLEBERNIER,B119,36220,36076,Fontgombault,36,,,360760000C0178,,,,,,,,,,,,,0,,,,,S,sols,,,833,0.981025,46.671088
2023-491408,2023-03-30,000001,Vente,145350,7,,RTE DES SABLES,0120,36220,36076,Fontgombault,36,,,36076000ZD0058,,,,,,,,,,,,,0,3,Dépendance,,0,S,sols,,,964,0.981466,46.670986
2023-491408,2023-03-30,000001,Vente,145350,7,,RTE DES SABLES,0120,36220,36076,Fontgombault,36,,,36076000ZD0058,,,,,,,,,,,,,0,3,Dépendance,,0,S,sols,,,964,0.981466,46.670986
2023-491408,2023-03-30,000001,Vente,145350,7,,RTE DES SABLES,0120,36220,36076,Fontgombault,36,,,36076000ZD0058,,,,,,,,,,,,,0,1,Maison,145,5,S,sols,,,964,0.981466,46.670986
2023-491408,2023-03-30,000001,Vente,145350,7,,RTE DES SABLES,0120,36220,36076,Fontgombault,36,,,36076000ZD0058,,,,,,,,,,,,,0,3,Dépendance,,0,J,jardins,,,1405,0.981466,46.670986
2023-491408,2023-03-30,000001,Vente,145350,7,,RTE DES SABLES,0120,36220,36076,Fontgombault,36,,,36076000ZD0058,,,,,,,,,,,,,0,3,Dépendance,,0,J,jardins,,,1405,0.981466,46.670986
2023-491408,2023-03-30,000001,Vente,145350,7,,RTE DES SABLES,0120,36220,36076,Fontgombault,36,,,36076000ZD0058,,,,,,,,,,,,,0,1,Maison,145,5,J,jardins,,,1405,0.981466,46.670986
2023-492008,2023-05-12,000001,Vente,800,,,CHAMPS BLANCHERES,B033,36220,36076,Fontgombault,36,,,36076000ZD0141,,,,,,,,,,,,,0,,,,,BT,taillis simples,,,1081,0.98003,46.666579
2023-493048,2023-06-07,000001,Vente,136000,7,,RTE DU POINT DU JOUR,0100,36220,36076,Fontgombault,36,,,360760000B1265,,,,,,,,,,,,,0,1,Maison,120,5,S,sols,,,359,0.989324,46.673563
2023-493048,2023-06-07,000001,Vente,136000,,,LES GRANDES VIGNES,B066,36220,36076,Fontgombault,36,,,36076000ZC0107,,,,,,,,,,,,,0,,,,,T,terres,,,1403,0.98947,46.673653
2023-493048,2023-06-07,000001,Vente,136000,,,LES GRANDES VIGNES,B066,36220,36076,Fontgombault,36,,,36076000ZC0107,,,,,,,,,,,,,0,,,,,S,sols,,,36,0.98947,46.673653
2023-493054,2023-07-12,000001,Vente,8500,5207,,LE CHATELET,B039,36220,36076,Fontgombault,36,,,36076000ZC0018,,,,,,,,,,,,,0,3,Dépendance,,0,J,jardins,,,1238,0.987695,46.6776
2023-493054,2023-07-12,000001,Vente,8500,5207,,LE CHATELET,B039,36220,36076,Fontgombault,36,,,36076000ZC0018,,,,,,,,,,,,,0,3,Dépendance,,0,S,sols,,,70,0.987695,46.6776
2023-494211,2023-09-26,000001,Vente,42000,,,PIECE DU BOIS,B086,36220,36076,Fontgombault,36,,,36076000ZE0010,,,,,,,,,,,,,0,,,,,T,terres,,,6023,0.950052,46.656088
