id_mutation,date_mutation,numero_disposition,nature_mutation,valeur_fonciere,adresse_numero,adresse_suffixe,adresse_nom_voie,adresse_code_voie,code_postal,code_commune,nom_commune,code_departement,ancien_code_commune,ancien_nom_commune,id_parcelle,ancien_id_parcelle,numero_volume,lot1_numero,lot1_surface_carrez,lot2_numero,lot2_surface_carrez,lot3_numero,lot3_surface_carrez,lot4_numero,lot4_surface_carrez,lot5_numero,lot5_surface_carrez,nombre_lots,code_type_local,type_local,surface_reelle_bati,nombre_pieces_principales,code_nature_culture,nature_culture,code_nature_culture_speciale,nature_culture_speciale,surface_terrain,longitude,latitude
2023-533269,2023-01-09,000001,Vente,31815,2,,RUE DES TOURNESOLS,0012,39380,39093,Chamblay,39,,,39093000ZA0152,,,,,,,,,,,,,0,,,,,T,terres,,,909,5.713014,46.997032
2023-533626,2023-01-25,000001,Vente,45000,,,VILLAGE,B059,39380,39093,Chamblay,39,,,39093000ZC0123,,,,,,,,,,,,,0,,,,,T,terres,,,2506,5.698932,46.995941
2023-534649,2023-03-31,000001,Vente,5000,,,CHENE BRULE,B018,39380,39093,Chamblay,39,,,39093000ZB0086,,,,,,,,,,,,,0,,,,,T,terres,,,4980,5.712077,46.99347
2023-534690,2023-03-31,000001,Vente,200000,13,,RUE DES TOURNESOLS,0012,39380,39093,Chamblay,39,,,39093000ZA0158,,,,,,,,,,,,,0,1,Maison,127,4,S,sols,,,818,5.712024,46.996564
2023-535316,2023-05-03,000001,Vente,14800,,,RUE DU BOIS,0001,39380,39093,Chamblay,39,,,39093000ZB0050,,,,,,,,,,,,,0,,,,,L,landes,,,465,5.70423,46.995127
2023-535823,2023-06-09,000001,Vente,335000,,,CROIX JEUNE,B026,39380,39093,Chamblay,39,,,39093000ZA0183,,,,,,,,,,,,,0,,,,,S,sols,,,640,5.715778,46.998369
2023-535823,2023-06-09,000002,Vente,335000,83,,GRANDE RUE,0006,39380,39093,Chamblay,39,,,39093000ZA0134,,,,,,,,,,,,,0,3,Dépendance,,0,S,sols,,,1960,5.715852,46.998389
2023-535823,2023-06-09,000002,Vente,335000,83,,GRANDE RUE,0006,39380,39093,Chamblay,39,,,39093000ZA0134,,,,,,,,,,,,,0,1,Maison,197,5,S,sols,,,1960,5.715852,46.998389
2023-535823,2023-06-09,000002,Vente,335000,83,,GRANDE RUE,0006,39380,39093,Chamblay,39,,,39093000ZA0134,,,,,,,,,,,,,0,3,Dépendance,,0,S,sols,,,1960,5.715852,46.998389
2023-535823,2023-06-09,000002,Vente,335000,,,CROIX JEUNE,B026,39380,39093,Chamblay,39,,,39093000ZA0137,,,,,,,,,,,,,0,,,,,T,terres,,,963,5.716076,46.998621
2023-536163,2023-06-22,000001,Vente,2800,,,AUX PERRIERES,B046,39380,39093,Chamblay,39,,,39093000ZE0012,,,,,,,,,,,,,0,,,,,P,prés,,,7775,5.68925,47.007379
2023-536163,2023-06-22,000001,Vente,2800,,,AUX PERRIERES,B046,39380,39093,Chamblay,39,,,39093000ZE0012,,,,,,,,,,,,,0,,,,,P,prés,,,7775,5.68925,47.007379
2023-536166,2023-06-22,000001,Vente,1730,,,CHAMP TOUSSAINT,B014,39380,39093,Chamblay,39,,,39093000ZE0035,,,,,,,,,,,,,0,,,,,T,terres,,,2117,5.698396,47.008776
2023-536166,2023-06-22,000001,Vente,1730,,,CHAMP TOUSSAINT,B014,39380,39093,Chamblay,39,,,39093000ZE0035,,,,,,,,,,,,,0,,,,,T,terres,,,4233,5.698396,47.008776
2023-536399,2023-07-06,000001,Vente,168000,91,,GRANDE RUE,0006,39380,39093,Chamblay,39,,,39093000ZA0035,,,,,,,,,,,,,0,3,Dépendance,,0,AG,terrains d'agrément,,,1825,5.719935,46.998733
2023-536399,2023-07-06,000001,Vente,168000,91,,GRANDE RUE,0006,39380,39093,Chamblay,39,,,39093000ZA0035,,,,,,,,,,,,,0,1,Maison,65,4,S,sols,,,1500,5.719935,46.998733
2023-536399,2023-07-06,000001,Vente,168000,91,,GRANDE RUE,0006,39380,39093,Chamblay,39,,,39093000ZA0035,,,,,,,,,,,,,0,3,Dépendance,,0,S,sols,,,1500,5.719935,46.998733
2023-536399,2023-07-06,000001,Vente,168000,91,,GRANDE RUE,0006,39380,39093,Chamblay,39,,,39093000ZA0035,,,,,,,,,,,,,0,1,Maison,65,4,AG,terrains d'agrément,,,1825,5.719935,46.998733
2023-538659,2023-11-09,000001,Vente,2400,,,CREUX CHAPELAIN,B024,39380,39093,Chamblay,39,,,39093000ZA0090,,,,,,,,,,,,,0,,,,,BT,taillis simples,,,1010,5.713733,46.998688
2023-538659,2023-11-09,000001,Vente,2400,,,CREUX CHAPELAIN,B024,39380,39093,Chamblay,39,,,39093000ZA0090,,,,,,,,,,,,,0,,,,,T,terres,,,14080,5.713733,46.998688
2023-539368,2023-12-19,000001,Vente,38000,83,,GRANDE RUE,0006,39380,39093,Chamblay,39,,,39093000ZA0182,,,,,,,,,,,,,0,4,Local industriel. commercial ou assimilé,210,0,S,sols,,,920,5.716048,46.998188
2023-539475,2023-12-15,000002,Vente,39787.26,,,CHAMPS DES VOIROLINS,B016,39380,39093,Chamblay,39,,,39093000ZC0129,,,,,,,,,,,,,0,,,,,T,terres,,,1062,,
2023-539475,2023-12-15,000002,Vente,39787.26,,,CHAMPS DES VOIROLINS,B016,39380,39093,Chamblay,39,,,39093000ZC0137,,,,,,,,,,,,,0,,,,,T,terres,,,160,,
