id_mutation,date_mutation,numero_disposition,nature_mutation,valeur_fonciere,adresse_numero,adresse_suffixe,adresse_nom_voie,adresse_code_voie,code_postal,code_commune,nom_commune,code_departement,ancien_code_commune,ancien_nom_commune,id_parcelle,ancien_id_parcelle,numero_volume,lot1_numero,lot1_surface_carrez,lot2_numero,lot2_surface_carrez,lot3_numero,lot3_surface_carrez,lot4_numero,lot4_surface_carrez,lot5_numero,lot5_surface_carrez,nombre_lots,code_type_local,type_local,surface_reelle_bati,nombre_pieces_principales,code_nature_culture,nature_culture,code_nature_culture_speciale,nature_culture_speciale,surface_terrain,longitude,latitude
2023-534283,2023-03-07,000001,Vente,1000,,,AU VILLAGE,B118,39570,39348,Montaigu,39,,,39348000AC0006,,,,,,,,,,,,,0,,,,,S,sols,,,36,5.564579,46.66032
2023-534489,2023-03-16,000001,Vente,147175,,,LES VIGNASSES,B116,39570,39348,Montaigu,39,,,39348000AI0338,,,,,,,,,,,,,0,,,,,P,prés,,,1669,5.586718,46.660272
2023-534489,2023-03-16,000001,Vente,147175,,,LES VIGNASSES,B116,39570,39348,Montaigu,39,,,39348000AI0339,,,,,,,,,,,,,0,,,,,P,prés,,,1562,5.58668,46.660494
2023-534489,2023-03-16,000001,Vente,147175,,,LES VIGNASSES,B116,39570,39348,Montaigu,39,,,39348000AI0340,,,,,,,,,,,,,0,,,,,P,prés,,,874,5.587154,46.660084
2023-534489,2023-03-16,000001,Vente,147175,,,LES VIGNASSES,B116,39570,39348,Montaigu,39,,,39348000AI0341,,,,,,,,,,,,,0,,,,,P,prés,,,602,5.587291,46.660212
2023-535064,2023-04-24,000001,Vente,700,,,LES CERISIERS,B015,39570,39348,Montaigu,39,,,39348000AC0375,,,,,,,,,,,,,0,,,,,VE,vergers,,,523,5.567705,46.656688
2023-535296,2023-04-19,000001,Vente,170000,3,,RUE DU MARTINET,0136,39570,39348,Montaigu,39,,,39348000AI0058,,,,,,,,,,,,,0,3,Dépendance,,0,S,sols,,,1095,5.588948,46.65767
2023-535296,2023-04-19,000001,Vente,170000,3,,RUE DU MARTINET,0136,39570,39348,Montaigu,39,,,39348000AI0058,,,,,,,,,,,,,0,3,Dépendance,,0,S,sols,,,1095,5.588948,46.65767
2023-535296,2023-04-19,000001,Vente,170000,3,,RUE DU MARTINET,0136,39570,39348,Montaigu,39,,,39348000AI0058,,,,,,,,,,,,,0,1,Maison,68,3,S,sols,,,1095,5.588948,46.65767
2023-535369,2023-05-11,000001,Vente,2500,,,LES GRANDS QUARTS,B050,39570,39348,Montaigu,39,,,39348000AO0221,,,,,,,,,,,,,0,,,,,P,prés,,,1358,5.552316,46.659023
2023-535369,2023-05-11,000001,Vente,2500,,,LES GRANDS QUARTS,B050,39570,39348,Montaigu,39,,,39348000AO0222,,,,,,,,,,,,,0,,,,,P,prés,,,1414,5.55228,46.658765
2023-535976,2023-06-16,000001,Vente,48750,9,,RUE DU PETIT BOURG,0137,39570,39348,Montaigu,39,,,39348000AC0093,,,,,,,,,,,,,0,1,Maison,110,5,S,sols,,,205,5.56753,46.659288
2023-535976,2023-06-16,000001,Vente,48750,,,AU VILLAGE,B118,39570,39348,Montaigu,39,,,39348000AC0118,,,,,,,,,,,,,0,,,,,S,sols,,,15,5.567233,46.659231
2023-535976,2023-06-16,000001,Vente,48750,,,AU VILLAGE,B118,39570,39348,Montaigu,39,,,39348000AC0119,,,,,,,,,,,,,0,,,,,S,sols,,,21,5.567245,46.659258
2023-535997,2023-06-14,000001,Echange,955,,,MOULIN DE L ECHENAUD,B066,39570,39348,Montaigu,39,,,39348000AE0134,,,,,,,,,,,,,0,,,,,L,landes,,,62,5.571998,46.667387
2023-535997,2023-06-14,000001,Echange,955,,,MOULIN DE L ECHENAUD,B066,39570,39348,Montaigu,39,,,39348000AE0137,,,,,,,,,,,,,0,,,,,E,eaux,CANAL,Canal,26,5.572007,46.667409
2023-535997,2023-06-14,000001,Echange,955,,,MOULIN DE L ECHENAUD,B066,39570,39348,Montaigu,39,,,39348000AE0139,,,,,,,,,,,,,0,,,,,P,prés,,,294,5.571982,46.667517
2023-535998,2023-06-14,000002,Echange,140,,,EN PONTU,B076,39570,39348,Montaigu,39,,,39348000AE0191,,,,,,,,,,,,,0,,,,,BT,taillis simples,,,70,5.57133,46.666993
2023-536545,2023-07-05,000001,Vente,100000,13,,PL ROUGET DE LISLE,0138,39570,39348,Montaigu,39,,,39348000AC0149,,,,,,,,,,,,,0,1,Maison,95,4,S,sols,,,237,5.565182,46.660304
2023-536545,2023-07-05,000001,Vente,100000,,,LE PIED DU MONT,B075,39570,39348,Montaigu,39,,,39348000AM0378,,,,,,,,,,,,,0,,,,,BT,taillis simples,,,669,5.575106,46.653233
2023-536545,2023-07-05,000001,Vente,100000,,,LE PIED DU MONT,B075,39570,39348,Montaigu,39,,,39348000AM0381,,,,,,,,,,,,,0,,,,,P,prés,,,2140,5.574945,46.653843
2023-536685,2023-07-13,000001,Vente,300,,,SUR LA PUTIERE,B083,39570,39348,Montaigu,39,,,39348000AC0211,,,,,,,,,,,,,0,,,,,J,jardins,,,359,5.568537,46.66056
2023-536778,2023-07-19,000001,Vente,200000,,,LES PETITS QUARTS,B073,39570,39348,Montaigu,39,,,39348000AB0230,,,,,,,,,,,,,0,,,,,P,prés,,,257,5.551139,46.663601
2023-536778,2023-07-19,000001,Vente,200000,471,,CHE DES PETITS QUARTS,0100,39570,39348,Montaigu,39,,,39348000AB0231,,,,,,,,,,,,,0,,,,,P,prés,,,17,5.55142,46.663527
2023-536778,2023-07-19,000001,Vente,200000,471,,CHE DES PETITS QUARTS,0100,39570,39348,Montaigu,39,,,39348000AB0234,,,,,,,,,,,,,0,,,,,P,prés,,,1,5.551217,46.663568
2023-536778,2023-07-19,000001,Vente,200000,,,LES PETITS QUARTS,B073,39570,39348,Montaigu,39,,,39348000AB0235,,,,,,,,,,,,,0,,,,,P,prés,,,2234,5.551919,46.663313
2023-536969,2023-07-31,000001,Vente,316400,1,,RUE DU 25 AOUT 1944,0141,39570,39348,Montaigu,39,,,39348000AC0144,,,,,,,,,,,,,0,3,Dépendance,,0,S,sols,,,576,5.565504,46.66009
2023-536969,2023-07-31,000001,Vente,316400,1,,RUE DU 25 AOUT 1944,0141,39570,39348,Montaigu,39,,,39348000AC0144,,,,,,,,,,,,,0,2,Appartement,80,2,S,sols,,,576,5.565504,46.66009
2023-536969,2023-07-31,000001,Vente,316400,1,,RUE DU 25 AOUT 1944,0141,39570,39348,Montaigu,39,,,39348000AC0144,,,,,,,,,,,,,0,2,Appartement,100,3,S,sols,,,576,5.565504,46.66009
2023-536969,2023-07-31,000001,Vente,316400,,,AU VILLAGE,B118,39570,39348,Montaigu,39,,,39348000AC0157,,,,,,,,,,,,,0,,,,,BT,taillis simples,,,1128,5.565876,46.660405
2023-537028,2023-07-17,000001,Vente,294000,,,SUR LES VERNES,B113,39570,39348,Montaigu,39,,,39348000AM0144,,,,,,,,,,,,,0,,,,,BT,taillis simples,,,3040,5.580335,46.657019
2023-537250,2023-08-25,000001,Vente,238000,1096,,RTE DE MONTAIGU,0090,39570,39348,Montaigu,39,,,39348000AB0156,,,,,,,,,,,,,0,1,Maison,128,6,S,sols,,,1050,5.55903,46.661064
2023-537250,2023-08-25,000001,Vente,238000,1096,,RTE DE MONTAIGU,0090,39570,39348,Montaigu,39,,,39348000AB0156,,,,,,,,,,,,,0,1,Maison,128,6,P,prés,,,780,5.55903,46.661064
2023-537250,2023-08-25,000001,Vente,238000,,,L HERBETTE,B055,39570,39348,Montaigu,39,,,39348000AB0218,,,,,,,,,,,,,0,,,,,P,prés,,,185,5.558881,46.660847
2023-537936,2023-09-29,000001,Vente,8000,,,LA ROCHE,B085,39570,39348,Montaigu,39,,,39348000AN0277,,,,,,,,,,,,,0,,,,,VI,vignes,VAOC,Vins d'appellation d'origine contrôlée,2561,5.56403,46.642996
2023-537936,2023-09-29,000001,Vente,8000,,,LA ROCHE,B085,39570,39348,Montaigu,39,,,39348000AN0439,,,,,,,,,,,,,0,,,,,VI,vignes,VAOC,Vins d'appellation d'origine contrôlée,2500,5.563286,46.643081
2023-538002,2023-10-03,000001,Vente,200,,,LA BARAQUE,B002,39570,39348,Montaigu,39,,,39348000AO0170,,,,,,,,,,,,,0,,,,,P,prés,,,765,5.555316,46.65568
2023-538748,2023-11-10,000001,Vente,2400,,,LA ROCHE,B085,39570,39348,Montaigu,39,,,39348000AN0267,,,,,,,,,,,,,0,,,,,VI,vignes,,,1896,5.562922,46.643447
2023-538748,2023-11-10,000001,Vente,2400,,,LA ROCHE,B085,39570,39348,Montaigu,39,,,39348000AN0268,,,,,,,,,,,,,0,,,,,VI,vignes,,,1010,5.562788,46.643242
2023-538749,2023-11-10,000001,Vente,600,,,LA ROCHE,B085,39570,39348,Montaigu,39,,,39348000AN0269,,,,,,,,,,,,,0,,,,,VI,vignes,,,765,5.562748,46.643101
2023-538770,2023-11-15,000001,Vente,75200,,,LES VIGNASSES,B116,39570,39348,Montaigu,39,,,39348000AI0338,,,,,,,,,,,,,0,,,,,P,prés,,,1669,5.586718,46.660272
2023-539244,2023-12-08,000001,Vente,6602.5,,,MONT CHENEVIER,B063,39570,39348,Montaigu,39,,,39348000AO0157,,,,,,,,,,,,,0,,,,,P,prés,,,1547,5.553908,46.654777
2023-539244,2023-12-08,000001,Vente,6602.5,,,MONT CHENEVIER,B063,39570,39348,Montaigu,39,,,39348000AO0161,,,,,,,,,,,,,0,,,,,P,prés,,,2340,5.554212,46.654704
2023-539244,2023-12-08,000001,Vente,6602.5,,,MONT CHENEVIER,B063,39570,39348,Montaigu,39,,,39348000AO0162,,,,,,,,,,,,,0,,,,,P,prés,,,3390,5.554366,46.654558
2023-539244,2023-12-08,000001,Vente,6602.5,,,MONT CHENEVIER,B063,39570,39348,Montaigu,39,,,39348000AO0163,,,,,,,,,,,,,0,,,,,P,prés,,,1979,5.554513,46.654228
2023-539244,2023-12-08,000001,Vente,6602.5,,,LA BARAQUE,B002,39570,39348,Montaigu,39,,,39348000AO0169,,,,,,,,,,,,,0,,,,,P,prés,,,3949,5.555148,46.655383
2023-539252,2023-12-08,000001,Vente,2195,,,LES GRANDS QUARTS,B050,39570,39348,Montaigu,39,,,39348000AO0228,,,,,,,,,,,,,0,,,,,P,prés,,,4390,5.553666,46.65847
2023-539304,2023-12-08,000001,Vente,21244.45,,,MONT CHENEVIER,B063,39570,39348,Montaigu,39,,,39348000AO0142,,,,,,,,,,,,,0,,,,,P,prés,,,961,5.555605,46.652586
2023-539304,2023-12-08,000001,Vente,21244.45,,,MONT CHENEVIER,B063,39570,39348,Montaigu,39,,,39348000AO0153,,,,,,,,,,,,,0,,,,,BT,taillis simples,,,586,5.55345,46.653723
2023-539304,2023-12-08,000001,Vente,21244.45,,,MONT CHENEVIER,B063,39570,39348,Montaigu,39,,,39348000AO0159,,,,,,,,,,,,,0,,,,,P,prés,,,1524,5.554199,46.655512
2023-539304,2023-12-08,000001,Vente,21244.45,,,DERRIERE LES TARTRES,B040,39570,39348,Montaigu,39,,,39348000AO0188,,,,,,,,,,,,,0,,,,,P,prés,,,3435,5.555313,46.657359
2023-539304,2023-12-08,000001,Vente,21244.45,,,DERRIERE LES TARTRES,B040,39570,39348,Montaigu,39,,,39348000AO0189,,,,,,,,,,,,,0,,,,,P,prés,,,1713,5.554649,46.657171
2023-539304,2023-12-08,000001,Vente,21244.45,,,DERRIERE LES TARTRES,B040,39570,39348,Montaigu,39,,,39348000AO0190,,,,,,,,,,,,,0,,,,,P,prés,,,1548,5.554345,46.656875
2023-539304,2023-12-08,000001,Vente,21244.45,,,DERRIERE LES TARTRES,B040,39570,39348,Montaigu,39,,,39348000AO0191,,,,,,,,,,,,,0,,,,,P,prés,,,2358,5.555228,46.656939
2023-539304,2023-12-08,000001,Vente,21244.45,,,DERRIERE LES TARTRES,B040,39570,39348,Montaigu,39,,,39348000AO0192,,,,,,,,,,,,,0,,,,,P,prés,,,4959,5.55532,46.65649
2023-539304,2023-12-08,000001,Vente,21244.45,,,DERRIERE LES TARTRES,B040,39570,39348,Montaigu,39,,,39348000AO0196,,,,,,,,,,,,,0,,,,,P,prés,,,1385,5.554074,46.656182
2023-539304,2023-12-08,000001,Vente,21244.45,,,EN POUPAND,B078,39570,39348,Montaigu,39,,,39348000AO0201,,,,,,,,,,,,,0,,,,,P,prés,,,2170,5.553154,46.655276
2023-539304,2023-12-08,000001,Vente,21244.45,,,EN POUPAND,B078,39570,39348,Montaigu,39,,,39348000AO0205,,,,,,,,,,,,,0,,,,,P,prés,,,5719,5.552514,46.656563
2023-539304,2023-12-08,000001,Vente,21244.45,,,EN POUPAND,B078,39570,39348,Montaigu,39,,,39348000AO0206,,,,,,,,,,,,,0,,,,,BT,taillis simples,,,1165,5.552765,46.656883
2023-539304,2023-12-08,000001,Vente,21244.45,,,EN POUPAND,B078,39570,39348,Montaigu,39,,,39348000AO0208,,,,,,,,,,,,,0,,,,,P,prés,,,6310,5.553463,46.656638
2023-539304,2023-12-08,000001,Vente,21244.45,,,LES QUARTS,B084,39570,39348,Montaigu,39,,,39348000AO0214,,,,,,,,,,,,,0,,,,,P,prés,,,8920,5.551732,46.657376
2023-539304,2023-12-08,000001,Vente,21244.45,,,LES GRANDS QUARTS,B050,39570,39348,Montaigu,39,,,39348000AO0240,,,,,,,,,,,,,0,,,,,BT,taillis simples,,,1170,5.555215,46.661809
2023-539304,2023-12-08,000001,Vente,21244.45,,,LES GRANDS QUARTS,B050,39570,39348,Montaigu,39,,,39348000AO0241,,,,,,,,,,,,,0,,,,,BT,taillis simples,,,1820,5.555559,46.66186
2023-539313,2023-12-13,000001,Vente,10000,,,AU VILLAGE,B118,39570,39348,Montaigu,39,,,39348000AC0116,,,,,,,,,,,,,0,,,,,S,sols,,,7,5.567227,46.659199
2023-539313,2023-12-13,000001,Vente,10000,,,AU VILLAGE,B118,39570,39348,Montaigu,39,,,39348000AC0120,,,,,,,,,,,,,0,,,,,S,sols,,,24,5.567249,46.659284
2023-539313,2023-12-13,000001,Vente,10000,,,AU VILLAGE,B118,39570,39348,Montaigu,39,,,39348000AC0528,,,,,,,,,,,,,0,,,,,S,sols,,,40,5.567427,46.659245
2023-539468,2023-12-14,000001,Vente,194850,9,,RUE DU PETIT BOURG,0137,39570,39348,Montaigu,39,,,39348000AC0093,,,,,,,,,,,,,0,1,Maison,110,5,S,sols,,,205,5.56753,46.659288
2023-539468,2023-12-14,000001,Vente,194850,,,AU VILLAGE,B118,39570,39348,Montaigu,39,,,39348000AC0118,,,,,,,,,,,,,0,,,,,S,sols,,,15,5.567233,46.659231
2023-539468,2023-12-14,000001,Vente,194850,,,AU VILLAGE,B118,39570,39348,Montaigu,39,,,39348000AC0119,,,,,,,,,,,,,0,,,,,S,sols,,,21,5.567245,46.659258
2023-539580,2023-12-28,000001,Vente,604,,,LE VERNOIS,B114,39570,39348,Montaigu,39,,,39348000AI0233,,,,,,,,,,,,,0,,,,,P,prés,,,3020,5.584822,46.661444
