id_mutation,date_mutation,numero_disposition,nature_mutation,valeur_fonciere,adresse_numero,adresse_suffixe,adresse_nom_voie,adresse_code_voie,code_postal,code_commune,nom_commune,code_departement,ancien_code_commune,ancien_nom_commune,id_parcelle,ancien_id_parcelle,numero_volume,lot1_numero,lot1_surface_carrez,lot2_numero,lot2_surface_carrez,lot3_numero,lot3_surface_carrez,lot4_numero,lot4_surface_carrez,lot5_numero,lot5_surface_carrez,nombre_lots,code_type_local,type_local,surface_reelle_bati,nombre_pieces_principales,code_nature_culture,nature_culture,code_nature_culture_speciale,nature_culture_speciale,surface_terrain,longitude,latitude
2023-540804,2023-02-08,000001,Vente,249900,610,,RTE DE BOUDICQ,0040,40180,40113,Goos,40,,,401130000B0774,,,,,,,,,,,,,0,1,Maison,144,6,S,sols,,,700,-0.900701,43.725078
2023-540804,2023-02-08,000001,Vente,249900,610,,RTE DE BOUDICQ,0040,40180,40113,Goos,40,,,401130000B0774,,,,,,,,,,,,,0,3,Dépendance,,0,J,jardins,,,500,-0.900701,43.725078
2023-540804,2023-02-08,000001,Vente,249900,610,,RTE DE BOUDICQ,0040,40180,40113,Goos,40,,,401130000B0774,,,,,,,,,,,,,0,3,Dépendance,,0,J,jardins,,,500,-0.900701,43.725078
2023-540804,2023-02-08,000001,Vente,249900,610,,RTE DE BOUDICQ,0040,40180,40113,Goos,40,,,401130000B0774,,,,,,,,,,,,,0,3,Dépendance,,0,S,sols,,,700,-0.900701,43.725078
2023-540804,2023-02-08,000001,Vente,249900,610,,RTE DE BOUDICQ,0040,40180,40113,Goos,40,,,401130000B0774,,,,,,,,,,,,,0,1,Maison,144,6,J,jardins,,,500,-0.900701,43.725078
2023-540804,2023-02-08,000001,Vente,249900,610,,RTE DE BOUDICQ,0040,40180,40113,Goos,40,,,401130000B0774,,,,,,,,,,,,,0,3,Dépendance,,0,S,sols,,,700,-0.900701,43.725078
2023-540804,2023-02-08,000001,Vente,249900,,,BOUDICQ,B005,40180,40113,Goos,40,,,401130000B0926,,,,,,,,,,,,,0,,,,,S,sols,,,250,-0.901004,43.725149
2023-543211,2023-04-24,000001,Vente,7236.9,,,TOUMILOT,B043,40180,40113,Goos,40,,,401130000C0604,,,,,,,,,,,,,0,,,,,BR,futaies résineuses,PIN,Pins,2461,-0.926387,43.734863
2023-543211,2023-04-24,000001,Vente,7236.9,,,TOUMILOT,B043,40180,40113,Goos,40,,,401130000C0605,,,,,,,,,,,,,0,,,,,BR,futaies résineuses,PIN,Pins,5580,-0.924955,43.734118
2023-544305,2023-05-31,000001,Vente,4560,,,LA FORET,B015,40180,40113,Goos,40,,,401130000C0029,,,,,,,,,,,,,0,,,,,T,terres,,,8290,-0.938444,43.734847
2023-544310,2023-05-31,000001,Vente,3756,,,LA FORET,B015,40180,40113,Goos,40,,,401130000C0643,,,,,,,,,,,,,0,,,,,T,terres,,,5430,-0.938414,43.732914
2023-544310,2023-05-31,000001,Vente,3756,,,LA FORET,B015,40180,40113,Goos,40,,,401130000C0643,,,,,,,,,,,,,0,,,,,P,prés,,,1400,-0.938414,43.732914
2023-545176,2023-06-22,000001,Vente,100602.2,,,COUSIN,B011,40180,40113,Goos,40,,,401130000B0436,,,,,,,,,,,,,0,,,,,T,terres,,,5948,-0.92012,43.724824
2023-545176,2023-06-22,000001,Vente,100602.2,,,POLIRON,B037,40180,40113,Goos,40,,,401130000C0340,,,,,,,,,,,,,0,,,,,BT,taillis simples,,,7245,-0.92804,43.725409
2023-545176,2023-06-22,000001,Vente,100602.2,,,POLIRON,B037,40180,40113,Goos,40,,,401130000C0341,,,,,,,,,,,,,0,,,,,L,landes,,,352,-0.928546,43.725684
2023-545176,2023-06-22,000001,Vente,100602.2,,,POLIRON,B037,40180,40113,Goos,40,,,401130000C0342,,,,,,,,,,,,,0,,,,,T,terres,,,3665,-0.928643,43.725043
2023-545176,2023-06-22,000001,Vente,100602.2,,,POLIRON,B037,40180,40113,Goos,40,,,401130000C0343,,,,,,,,,,,,,0,,,,,T,terres,,,6590,-0.927721,43.724963
2023-545176,2023-06-22,000001,Vente,100602.2,,,DARROUZES,B012,40180,40113,Goos,40,,,401130000C0379,,,,,,,,,,,,,0,,,,,T,terres,,,1827,-0.925831,43.724205
2023-545176,2023-06-22,000001,Vente,100602.2,,,DARROUZES,B012,40180,40113,Goos,40,,,401130000C0380,,,,,,,,,,,,,0,,,,,T,terres,,,7385,-0.92681,43.724026
2023-545176,2023-06-22,000001,Vente,100602.2,,,DARROUZES,B012,40180,40113,Goos,40,,,401130000C0392,,,,,,,,,,,,,0,,,,,T,terres,,,3450,-0.926266,43.72296
2023-545176,2023-06-22,000001,Vente,100602.2,,,DARROUZES,B012,40180,40113,Goos,40,,,401130000C0393,,,,,,,,,,,,,0,,,,,T,terres,,,3766,-0.925482,43.723602
2023-545176,2023-06-22,000001,Vente,100602.2,,,DARROUZES,B012,40180,40113,Goos,40,,,401130000C0394,,,,,,,,,,,,,0,,,,,T,terres,,,4855,-0.925476,43.722868
2023-545176,2023-06-22,000001,Vente,100602.2,,,CARMET,B007,40180,40113,Goos,40,,,401130000C0450,,,,,,,,,,,,,0,,,,,P,prés,,,2531,-0.929536,43.721471
2023-545176,2023-06-22,000001,Vente,100602.2,,,CARMET,B007,40180,40113,Goos,40,,,401130000C0451,,,,,,,,,,,,,0,,,,,T,terres,,,1491,-0.929383,43.72179
2023-545176,2023-06-22,000001,Vente,100602.2,,,CARMET,B007,40180,40113,Goos,40,,,401130000C0454,,,,,,,,,,,,,0,,,,,T,terres,,,6165,-0.929597,43.723173
2023-545176,2023-06-22,000001,Vente,100602.2,,,CARMET,B007,40180,40113,Goos,40,,,401130000C0455,,,,,,,,,,,,,0,,,,,T,terres,,,5041,-0.928542,43.722826
2023-545176,2023-06-22,000001,Vente,100602.2,,,CARMET,B007,40180,40113,Goos,40,,,401130000C0459,,,,,,,,,,,,,0,,,,,T,terres,,,4309,-0.927471,43.72371
2023-545176,2023-06-22,000001,Vente,100602.2,,,CARMET,B007,40180,40113,Goos,40,,,401130000C0460,,,,,,,,,,,,,0,,,,,T,terres,,,1410,-0.927141,43.724175
2023-545176,2023-06-22,000001,Vente,100602.2,,,CARMET,B007,40180,40113,Goos,40,,,401130000C0461,,,,,,,,,,,,,0,,,,,T,terres,,,4158,-0.927728,43.724167
2023-545176,2023-06-22,000001,Vente,100602.2,,,DARROUZES,B012,40180,40113,Goos,40,,,401130000C0636,,,,,,,,,,,,,0,,,,,T,terres,,,4695,-0.926437,43.723452
2023-545176,2023-06-22,000001,Vente,100602.2,,,CARMET,B007,40180,40113,Goos,40,,,401130000C0638,,,,,,,,,,,,,0,,,,,T,terres,,,4049,-0.929448,43.722058
2023-545176,2023-06-22,000001,Vente,100602.2,,,CARMET,B007,40180,40113,Goos,40,,,401130000C0640,,,,,,,,,,,,,0,,,,,T,terres,,,3526,-0.929315,43.722407
2023-545176,2023-06-22,000001,Vente,100602.2,,,DARROUZES,B012,40180,40113,Goos,40,,,401130000C0654,,,,,,,,,,,,,0,,,,,T,terres,,,8305,-0.925113,43.724445
2023-545176,2023-06-22,000001,Vente,100602.2,,,DARROUZES,B012,40180,40113,Goos,40,,,401130000C0656,,,,,,,,,,,,,0,,,,,T,terres,,,2364,-0.924985,43.723531
2023-545176,2023-06-22,000001,Vente,100602.2,,,DARROUZES,B012,40180,40113,Goos,40,,,401130000C0660,,,,,,,,,,,,,0,,,,,T,terres,,,8305,-0.92595,43.722112
2023-545176,2023-06-22,000001,Vente,100602.2,,,DARROUZES,B012,40180,40113,Goos,40,,,401130000C0662,,,,,,,,,,,,,0,,,,,BT,taillis simples,,,745,-0.924804,43.72497
2023-545176,2023-06-22,000001,Vente,100602.2,,,CARMET,B007,40180,40113,Goos,40,,,401130000C0746,,,,,,,,,,,,,0,,,,,T,terres,,,5194,-0.928473,43.720647
2023-545176,2023-06-22,000001,Vente,100602.2,,,CARMET,B007,40180,40113,Goos,40,,,401130000C0747,,,,,,,,,,,,,0,,,,,T,terres,,,6674,-0.927295,43.720154
2023-545176,2023-06-22,000001,Vente,100602.2,,,CARMET,B007,40180,40113,Goos,40,,,401130000C0748,,,,,,,,,,,,,0,,,,,P,prés,,,3110,-0.928063,43.719982
2023-545435,2023-06-26,000001,Vente,260000,,,COURSET,B010,40180,40113,Goos,40,,,401130000B1021,,,,,,,,,,,,,0,,,,,AB,terrains a bâtir,,,857,-0.913434,43.732887
2023-545435,2023-06-26,000001,Vente,260000,,,COURSET,B010,40180,40113,Goos,40,,,401130000B1022,,,,,,,,,,,,,0,,,,,AB,terrains a bâtir,,,203,-0.913294,43.732903
2023-546084,2023-07-17,000001,Vente,24275,,,LANDRAN,B027,40180,40113,Goos,40,,,401130000B0592,,,,,,,,,,,,,0,,,,,BT,taillis simples,,,2845,-0.907261,43.717621
2023-546084,2023-07-17,000001,Vente,24275,,,LANDRAN,B027,40180,40113,Goos,40,,,401130000B0593,,,,,,,,,,,,,0,,,,,T,terres,,,9378,-0.907175,43.717895
2023-546084,2023-07-17,000001,Vente,24275,,,LANDRAN,B027,40180,40113,Goos,40,,,401130000B0593,,,,,,,,,,,,,0,,,,,BR,futaies résineuses,PIN,Pins,12312,-0.907175,43.717895
2023-546084,2023-07-17,000001,Vente,24275,,,CARMET,B007,40180,40113,Goos,40,,,401130000C0462,,,,,,,,,,,,,0,,,,,T,terres,,,9180,-0.928408,43.723751
2023-546084,2023-07-17,000001,Vente,24275,,,CARMET,B007,40180,40113,Goos,40,,,401130000C0463,,,,,,,,,,,,,0,,,,,T,terres,,,7575,-0.92948,43.723963
2023-546084,2023-07-17,000001,Vente,24275,,,CARMET,B007,40180,40113,Goos,40,,,401130000C0619,,,,,,,,,,,,,0,,,,,P,prés,,,40,-0.929629,43.724297
2023-546085,2023-07-17,000001,Vente,61574,,,DARROUZES,B012,40180,40113,Goos,40,,,401130000C0387,,,,,,,,,,,,,0,,,,,S,sols,,,90,-0.927798,43.7225
2023-546085,2023-07-17,000001,Vente,61574,,,DARROUZES,B012,40180,40113,Goos,40,,,401130000C0387,,,,,,,,,,,,,0,,,,,VI,vignes,,,2950,-0.927798,43.7225
2023-546085,2023-07-17,000001,Vente,61574,,,DARROUZES,B012,40180,40113,Goos,40,,,401130000C0387,,,,,,,,,,,,,0,,,,,L,landes,,,645,-0.927798,43.7225
2023-546085,2023-07-17,000001,Vente,61574,,,DARROUZES,B012,40180,40113,Goos,40,,,401130000C0388,,,,,,,,,,,,,0,,,,,P,prés,,,1077,-0.927065,43.72201
2023-546085,2023-07-17,000001,Vente,61574,,,DARROUZES,B012,40180,40113,Goos,40,,,401130000C0391,,,,,,,,,,,,,0,,,,,T,terres,,,6642,-0.926724,43.722404
2023-546085,2023-07-17,000001,Vente,61574,,,CARMET,B007,40180,40113,Goos,40,,,401130000C0438,,,,,,,,,,,,,0,,,,,T,terres,,,8604,-0.92479,43.719913
2023-546085,2023-07-17,000001,Vente,61574,,,CARMET,B007,40180,40113,Goos,40,,,401130000C0439,,,,,,,,,,,,,0,,,,,BR,futaies résineuses,PIN,Pins,4670,-0.924048,43.720076
2023-546085,2023-07-17,000001,Vente,61574,,,CARMET,B007,40180,40113,Goos,40,,,401130000C0440,,,,,,,,,,,,,0,,,,,BF,futaies feuillues,,,3924,-0.925972,43.721358
2023-546085,2023-07-17,000001,Vente,61574,,,CARMET,B007,40180,40113,Goos,40,,,401130000C0441,,,,,,,,,,,,,0,,,,,T,terres,,,23080,-0.926849,43.721409
2023-546085,2023-07-17,000001,Vente,61574,,,PRAIRIES,B041,40180,40113,Goos,40,,,401130000C0642,,,,,,,,,,,,,0,,,,,T,terres,,,6015,-0.943841,43.727378
2023-546085,2023-07-17,000001,Vente,61574,,,DARROUZES,B012,40180,40113,Goos,40,,,401130000C0694,,,,,,,,,,,,,0,,,,,T,terres,,,690,-0.926858,43.723613
2023-547294,2023-08-22,000001,Vente,150000,555,,RTE DU BOURG DE BAGUE,0015,40180,40113,Goos,40,,,401130000B0082,,,,,,,,,,,,,0,1,Maison,118,8,S,sols,,,800,-0.912653,43.734656
2023-547294,2023-08-22,000001,Vente,150000,,,COURSET,B010,40180,40113,Goos,40,,,401130000B0083,,,,,,,,,,,,,0,,,,,J,jardins,,,1050,-0.912436,43.734668
2023-547294,2023-08-22,000001,Vente,150000,,,COURSET,B010,40180,40113,Goos,40,,,401130000B0084,,,,,,,,,,,,,0,,,,,BP,peupleraies,,,1270,-0.911983,43.734843
2023-547294,2023-08-22,000001,Vente,150000,,,COURSET,B010,40180,40113,Goos,40,,,401130000B0084,,,,,,,,,,,,,0,,,,,BF,futaies feuillues,,,698,-0.911983,43.734843
2023-547294,2023-08-22,000001,Vente,150000,,,COURSET,B010,40180,40113,Goos,40,,,401130000B0085,,,,,,,,,,,,,0,,,,,BF,futaies feuillues,,,1000,-0.911519,43.734736
2023-547294,2023-08-22,000001,Vente,150000,,,COURSET,B010,40180,40113,Goos,40,,,401130000B0085,,,,,,,,,,,,,0,,,,,BP,peupleraies,,,1730,-0.911519,43.734736
2023-547294,2023-08-22,000001,Vente,150000,,,COURSET,B010,40180,40113,Goos,40,,,401130000B1124,,,,,,,,,,,,,0,,,,,BP,peupleraies,,,336,-0.912211,43.734487
2023-547294,2023-08-22,000001,Vente,150000,,,COURSET,B010,40180,40113,Goos,40,,,401130000B1126,,,,,,,,,,,,,0,,,,,L,landes,,,547,-0.912796,43.734663
2023-548295,2023-09-25,000001,Vente,53000,,,BOURG DE BAGUE,B006,40180,40113,Goos,40,,,401130000B1123,,,,,,,,,,,,,0,,,,,AB,terrains a bâtir,,,700,-0.911581,43.733623
2023-549605,2023-11-13,000001,Vente,120000,519,,RTE DE BARRAGUIN,0020,40180,40113,Goos,40,,,401130000B0176,,,,,,,,,,,,,0,1,Maison,90,5,J,jardins,,,763,-0.90508,43.73249
2023-549605,2023-11-13,000001,Vente,120000,519,,RTE DE BARRAGUIN,0020,40180,40113,Goos,40,,,401130000B0176,,,,,,,,,,,,,0,1,Maison,90,5,S,sols,,,530,-0.90508,43.73249
2023-549916,2023-11-22,000001,Vente,3756,,,LA FORET,B015,40180,40113,Goos,40,,,401130000C0644,,,,,,,,,,,,,0,,,,,T,terres,,,5342,-0.938409,43.733545
2023-549916,2023-11-22,000001,Vente,3756,,,LA FORET,B015,40180,40113,Goos,40,,,401130000C0644,,,,,,,,,,,,,0,,,,,P,prés,,,1488,-0.938409,43.733545
