id_mutation,date_mutation,numero_disposition,nature_mutation,valeur_fonciere,adresse_numero,adresse_suffixe,adresse_nom_voie,adresse_code_voie,code_postal,code_commune,nom_commune,code_departement,ancien_code_commune,ancien_nom_commune,id_parcelle,ancien_id_parcelle,numero_volume,lot1_numero,lot1_surface_carrez,lot2_numero,lot2_surface_carrez,lot3_numero,lot3_surface_carrez,lot4_numero,lot4_surface_carrez,lot5_numero,lot5_surface_carrez,nombre_lots,code_type_local,type_local,surface_reelle_bati,nombre_pieces_principales,code_nature_culture,nature_culture,code_nature_culture_speciale,nature_culture_speciale,surface_terrain,longitude,latitude
2023-545341,2023-06-30,000001,Vente,590000,,,BEYRIERE,B006,40250,40144,Larbey,40,,,401440000C0068,,,,,,,,,,,,,0,,,,,J,jardins,,,734,-0.71644,43.703284
2023-545341,2023-06-30,000001,Vente,590000,121,,RTE DE MAYLIS,0095,40250,40144,Larbey,40,,,401440000C0069,,,,,,,,,,,,,0,1,Maison,320,9,S,sols,,,862,-0.716491,43.703445
2023-545341,2023-06-30,000001,Vente,590000,,,BEYRIERE,B006,40250,40144,Larbey,40,,,401440000C0070,,,,,,,,,,,,,0,,,,,T,terres,,,718,-0.716344,43.703658
2023-545341,2023-06-30,000001,Vente,590000,,,BEYRIERE,B006,40250,40144,Larbey,40,,,401440000C0071,,,,,,,,,,,,,0,,,,,T,terres,,,835,-0.716389,43.703912
2023-545341,2023-06-30,000001,Vente,590000,,,BEYRIERE,B006,40250,40144,Larbey,40,,,401440000C0073,,,,,,,,,,,,,0,,,,,T,terres,,,2838,-0.715703,43.703821
2023-545341,2023-06-30,000001,Vente,590000,,,BEYRIERE,B006,40250,40144,Larbey,40,,,401440000C0074,,,,,,,,,,,,,0,,,,,T,terres,,,2185,-0.715963,43.703422
2023-545341,2023-06-30,000001,Vente,590000,,,BEYRIERE,B006,40250,40144,Larbey,40,,,401440000C0406,,,,,,,,,,,,,0,,,,,L,landes,,,517,-0.716685,43.703721
2023-546075,2023-07-18,000001,Vente,205000,659,,RTE LESTAGE,0085,40250,40144,Larbey,40,,,401440000B0566,,,,,,,,,,,,,0,3,Dépendance,,0,S,sols,,,1575,-0.738153,43.700075
2023-546075,2023-07-18,000001,Vente,205000,659,,RTE LESTAGE,0085,40250,40144,Larbey,40,,,401440000B0566,,,,,,,,,,,,,0,1,Maison,101,5,S,sols,,,1575,-0.738153,43.700075
2023-546075,2023-07-18,000001,Vente,205000,,,BOURDET,B008,40250,40144,Larbey,40,,,401440000B0567,,,,,,,,,,,,,0,,,,,S,sols,,,43,-0.73858,43.700188
2023-546861,2023-07-24,000001,Vente,603600,,,CAM DE LOUS,B010,40250,40144,Larbey,40,,,401440000B0429,,,,,,,,,,,,,0,,,,,BT,taillis simples,,,8289,-0.743862,43.700762
2023-546861,2023-07-24,000001,Vente,603600,,,CAM DE LOUS,B010,40250,40144,Larbey,40,,,401440000B0430,,,,,,,,,,,,,0,,,,,BT,taillis simples,,,912,-0.743146,43.700599
2023-546861,2023-07-24,000001,Vente,603600,,,CAM DE LOUS,B010,40250,40144,Larbey,40,,,401440000B0431,,,,,,,,,,,,,0,,,,,T,terres,,,4123,-0.743498,43.701526
2023-546861,2023-07-24,000001,Vente,603600,,,CAM DE LOUS,B010,40250,40144,Larbey,40,,,401440000B0432,,,,,,,,,,,,,0,,,,,T,terres,,,4972,-0.743048,43.701321
2023-546861,2023-07-24,000001,Vente,603600,,,CAM DE LOUS,B010,40250,40144,Larbey,40,,,401440000B0433,,,,,,,,,,,,,0,,,,,BT,taillis simples,,,3938,-0.743058,43.702264
2023-546861,2023-07-24,000001,Vente,603600,,,CAM DE LOUS,B010,40250,40144,Larbey,40,,,401440000B0434,,,,,,,,,,,,,0,,,,,T,terres,,,4308,-0.743148,43.702985
2023-546861,2023-07-24,000001,Vente,603600,,,CAM DE LOUS,B010,40250,40144,Larbey,40,,,401440000B0435,,,,,,,,,,,,,0,,,,,T,terres,,,12147,-0.744086,43.702237
2023-546861,2023-07-24,000001,Vente,603600,,,CAM DE LOUS,B010,40250,40144,Larbey,40,,,401440000B0436,,,,,,,,,,,,,0,,,,,L,landes,,,1294,-0.74417,43.701651
2023-546861,2023-07-24,000001,Vente,603600,,,CAM DE LOUS,B010,40250,40144,Larbey,40,,,401440000B0437,,,,,,,,,,,,,0,,,,,P,prés,,,5107,-0.744582,43.701424
2023-546861,2023-07-24,000001,Vente,603600,,,CAM DE LOUS,B010,40250,40144,Larbey,40,,,401440000B0438,,,,,,,,,,,,,0,,,,,L,landes,,,502,-0.744665,43.701766
2023-546861,2023-07-24,000001,Vente,603600,,,CAM DE LOUS,B010,40250,40144,Larbey,40,,,401440000B0438,,,,,,,,,,,,,0,,,,,S,sols,,,421,-0.744665,43.701766
2023-546861,2023-07-24,000001,Vente,603600,,,CAM DE LOUS,B010,40250,40144,Larbey,40,,,401440000B0439,,,,,,,,,,,,,0,,,,,L,landes,,,742,-0.744598,43.702314
2023-546861,2023-07-24,000001,Vente,603600,,,CAM DE LOUS,B010,40250,40144,Larbey,40,,,401440000B0440,,,,,,,,,,,,,0,,,,,T,terres,,,2646,-0.744749,43.70244
2023-546861,2023-07-24,000001,Vente,603600,,,CAM DE LOUS,B010,40250,40144,Larbey,40,,,401440000B0441,,,,,,,,,,,,,0,,,,,J,jardins,,,706,-0.745192,43.702184
2023-546861,2023-07-24,000001,Vente,603600,823,,RTE DU LOUTS,0090,40250,40144,Larbey,40,,,401440000B0442,,,,,,,,,,,,,0,1,Maison,101,4,S,sols,,,444,-0.744854,43.702038
2023-546861,2023-07-24,000001,Vente,603600,,,CAM DE LOUS,B010,40250,40144,Larbey,40,,,401440000B0443,,,,,,,,,,,,,0,,,,,L,landes,,,327,-0.745102,43.701914
2023-546861,2023-07-24,000001,Vente,603600,,,CAM DE LOUS,B010,40250,40144,Larbey,40,,,401440000B0444,,,,,,,,,,,,,0,,,,,T,terres,,,5167,-0.745617,43.701875
2023-547698,2023-09-15,000001,Vente,18000,,,BOURDET,B008,40250,40144,Larbey,40,,,401440000B0262,,,,,,,,,,,,,0,,,,,T,terres,,,4170,-0.733646,43.699484
2023-547698,2023-09-15,000001,Vente,18000,,,BOURDET,B008,40250,40144,Larbey,40,,,401440000B0263,,,,,,,,,,,,,0,,,,,T,terres,,,3676,-0.734259,43.698583
2023-547698,2023-09-15,000001,Vente,18000,,,PASSAN,B029,40250,40144,Larbey,40,,,401440000B0281,,,,,,,,,,,,,0,,,,,T,terres,,,1177,-0.731483,43.694934
2023-547698,2023-09-15,000001,Vente,18000,,,PASSAN,B029,40250,40144,Larbey,40,,,401440000B0283,,,,,,,,,,,,,0,,,,,T,terres,,,4737,-0.732159,43.695128
2023-547698,2023-09-15,000001,Vente,18000,,,PASSAN,B029,40250,40144,Larbey,40,,,401440000B0286,,,,,,,,,,,,,0,,,,,T,terres,,,10208,-0.73333,43.695081
