id_mutation,date_mutation,numero_disposition,nature_mutation,valeur_fonciere,adresse_numero,adresse_suffixe,adresse_nom_voie,adresse_code_voie,code_postal,code_commune,nom_commune,code_departement,ancien_code_commune,ancien_nom_commune,id_parcelle,ancien_id_parcelle,numero_volume,lot1_numero,lot1_surface_carrez,lot2_numero,lot2_surface_carrez,lot3_numero,lot3_surface_carrez,lot4_numero,lot4_surface_carrez,lot5_numero,lot5_surface_carrez,nombre_lots,code_type_local,type_local,surface_reelle_bati,nombre_pieces_principales,code_nature_culture,nature_culture,code_nature_culture_speciale,nature_culture_speciale,surface_terrain,longitude,latitude
2023-541402,2023-03-07,000001,Vente,65000,,,LES FABIANS,B013,40250,40153,Le Leuy,40,,,401530000E0060,,,,,,,,,,,,,0,,,,,T,terres,,,18757,-0.636951,43.808634
2023-541402,2023-03-07,000001,Vente,65000,,,LES FABIANS,B013,40250,40153,Le Leuy,40,,,401530000E0061,,,,,,,,,,,,,0,,,,,T,terres,,,5067,-0.636773,43.808225
2023-541402,2023-03-07,000001,Vente,65000,,,LES FABIANS,B013,40250,40153,Le Leuy,40,,,401530000E0068,,,,,,,,,,,,,0,,,,,T,terres,,,40126,-0.637034,43.807295
2023-541402,2023-03-07,000001,Vente,65000,,,LES FABIANS,B013,40250,40153,Le Leuy,40,,,401530000E0077,,,,,,,,,,,,,0,,,,,T,terres,,,1406,-0.638232,43.807614
2023-541402,2023-03-07,000001,Vente,65000,,,LES FABIANS,B013,40250,40153,Le Leuy,40,,,401530000E0078,,,,,,,,,,,,,0,,,,,T,terres,,,754,-0.638,43.807898
2023-541402,2023-03-07,000001,Vente,65000,,,LES FABIANS,B013,40250,40153,Le Leuy,40,,,401530000E0079,,,,,,,,,,,,,0,,,,,T,terres,,,655,-0.637936,43.808192
2023-541402,2023-03-07,000001,Vente,65000,,,LES FABIANS,B013,40250,40153,Le Leuy,40,,,401530000E0080,,,,,,,,,,,,,0,,,,,T,terres,,,2613,-0.638414,43.808022
2023-541402,2023-03-07,000001,Vente,65000,,,LES FABIANS,B013,40250,40153,Le Leuy,40,,,401530000E0081,,,,,,,,,,,,,0,,,,,T,terres,,,1864,-0.638708,43.808271
2023-541402,2023-03-07,000001,Vente,65000,,,LES FABIANS,B013,40250,40153,Le Leuy,40,,,401530000E0082,,,,,,,,,,,,,0,,,,,T,terres,,,2588,-0.639393,43.808417
2023-541402,2023-03-07,000001,Vente,65000,,,LES FABIANS,B013,40250,40153,Le Leuy,40,,,401530000E0083,,,,,,,,,,,,,0,,,,,T,terres,,,2157,-0.639902,43.808381
2023-542316,2023-04-03,000001,Vente,19700,,,TOUYON,B039,40250,40153,Le Leuy,40,,,401530000B0018,,,,,,,,,,,,,0,,,,,L,landes,,,1840,-0.655897,43.833542
2023-542316,2023-04-03,000001,Vente,19700,,,TOUYON,B039,40250,40153,Le Leuy,40,,,401530000B0019,,,,,,,,,,,,,0,,,,,B,bois,,,17657,-0.655962,43.83224
2023-542316,2023-04-03,000001,Vente,19700,,,TOUYON,B039,40250,40153,Le Leuy,40,,,401530000B0019,,,,,,,,,,,,,0,,,,,BR,futaies résineuses,PIN,Pins,4414,-0.655962,43.83224
2023-543301,2023-04-27,000001,Vente,156879,51,,MARANCIN,B023,40250,40153,Le Leuy,40,,,401530000F0174,,,,,,,,,,,,,0,1,Maison,120,5,S,sols,,,560,-0.653059,43.817244
2023-543301,2023-04-27,000001,Vente,156879,51,,MARANCIN,B023,40250,40153,Le Leuy,40,,,401530000F0174,,,,,,,,,,,,,0,3,Dépendance,,0,S,sols,,,560,-0.653059,43.817244
2023-543301,2023-04-27,000001,Vente,156879,51,,MARANCIN,B023,40250,40153,Le Leuy,40,,,401530000F0174,,,,,,,,,,,,,0,3,Dépendance,,0,S,sols,,,560,-0.653059,43.817244
2023-543301,2023-04-27,000001,Vente,156879,52,,MARANCIN,B023,40250,40153,Le Leuy,40,,,401530000F0175,,,,,,,,,,,,,0,3,Dépendance,,0,S,sols,,,480,-0.65281,43.817207
2023-547038,2023-08-03,000001,Vente,8330,,,BROUSTE,B008,40250,40153,Le Leuy,40,,,401530000C0061,,,,,,,,,,,,,0,,,,,T,terres,,,2374,-0.630063,43.824317
2023-547317,2023-08-23,000001,Vente,194000,,,LAGRANGE,B020,40250,40153,Le Leuy,40,,,401530000F0304,,,,,,,,,,,,,0,,,,,S,sols,,,892,-0.651912,43.820355
2023-547317,2023-08-23,000001,Vente,194000,221,,ALL DE LAGRANGE,0105,40250,40153,Le Leuy,40,,,401530000F0318,,,,,,,,,,,,,0,1,Maison,82,3,S,sols,,,190,-0.651943,43.820502
2023-547317,2023-08-23,000001,Vente,194000,221,,ALL DE LAGRANGE,0105,40250,40153,Le Leuy,40,,,401530000F0318,,,,,,,,,,,,,0,3,Dépendance,,0,S,sols,,,190,-0.651943,43.820502
2023-547317,2023-08-23,000001,Vente,194000,,,LAGRANGE,B020,40250,40153,Le Leuy,40,,,401530000F0323,,,,,,,,,,,,,0,,,,,S,sols,,,135,-0.651654,43.820264
2023-547317,2023-08-23,000001,Vente,194000,,,LAGRANGE,B020,40250,40153,Le Leuy,40,,,401530000F0324,,,,,,,,,,,,,0,,,,,S,sols,,,90,-0.651766,43.820033
2023-547317,2023-08-23,000001,Vente,194000,,,LAGRANGE,B020,40250,40153,Le Leuy,40,,,401530000F0355,,,,,,,,,,,,,0,,,,,J,jardins,,,630,-0.652017,43.820084
2023-549423,2023-10-24,000001,Vente,178099,,,PARIS,B028,40250,40153,Le Leuy,40,,,401530000G0254,,,,,,,,,,,,,0,,,,,J,jardins,,,1154,-0.657914,43.812889
2023-549423,2023-10-24,000001,Vente,178099,,,PARIS,B028,40250,40153,Le Leuy,40,,,401530000G0257,,,,,,,,,,,,,0,,,,,J,jardins,,,2259,-0.657907,43.813708
2023-549423,2023-10-24,000001,Vente,178099,65,,PARIS,B028,40250,40153,Le Leuy,40,,,401530000G0258,,,,,,,,,,,,,0,3,Dépendance,,0,S,sols,,,689,-0.657839,43.813976
2023-549423,2023-10-24,000001,Vente,178099,65,,PARIS,B028,40250,40153,Le Leuy,40,,,401530000G0258,,,,,,,,,,,,,0,1,Maison,115,4,S,sols,,,689,-0.657839,43.813976
2023-549423,2023-10-24,000001,Vente,178099,,,PARIS,B028,40250,40153,Le Leuy,40,,,401530000G0259,,,,,,,,,,,,,0,,,,,J,jardins,,,271,-0.65754,43.814011
2023-549423,2023-10-24,000001,Vente,178099,,,PARIS,B028,40250,40153,Le Leuy,40,,,401530000G0260,,,,,,,,,,,,,0,,,,,J,jardins,,,873,-0.658128,43.814004
