id_mutation,date_mutation,numero_disposition,nature_mutation,valeur_fonciere,adresse_numero,adresse_suffixe,adresse_nom_voie,adresse_code_voie,code_postal,code_commune,nom_commune,code_departement,ancien_code_commune,ancien_nom_commune,id_parcelle,ancien_id_parcelle,numero_volume,lot1_numero,lot1_surface_carrez,lot2_numero,lot2_surface_carrez,lot3_numero,lot3_surface_carrez,lot4_numero,lot4_surface_carrez,lot5_numero,lot5_surface_carrez,nombre_lots,code_type_local,type_local,surface_reelle_bati,nombre_pieces_principales,code_nature_culture,nature_culture,code_nature_culture_speciale,nature_culture_speciale,surface_terrain,longitude,latitude
2023-552775,2023-01-12,000001,Vente,63600,70,,PL DU PRESBYTERE,0070,41230,41268,Veilleins,41,,,412680000C0451,,,,,,,,,,,,,0,1,Maison,87,4,S,sols,,,968,1.671798,47.420728
2023-552775,2023-01-12,000001,Vente,63600,,,LE BOURG,B007,41230,41268,Veilleins,41,,,412680000C0564,,,,,,,,,,,,,0,,,,,P,prés,,,459,1.67156,47.421028
2023-553335,2023-03-21,000001,Vente,17000,13,,PL DE L EGLISE,0045,41230,41268,Veilleins,41,,,412680000C0527,,,,,,,,,,,,,0,1,Maison,43,2,S,sols,,,114,1.67034,47.421251
2023-557458,2023-09-04,000001,Vente,7500,,,L ETANG NEUF,B020,41230,41268,Veilleins,41,,,412680000D0587,,,,,,,,,,,,,0,,,,,BR,futaies résineuses,,,12450,1.65017,47.417794
2023-557458,2023-09-04,000001,Vente,7500,1607,,RTE DE MUR DE SOLOGNE,0200,41230,41268,Veilleins,41,,,412680000D0589,,,,,,,,,,,,,0,3,Dépendance,,0,BT,taillis simples,,,1500,1.650531,47.416754
2023-557458,2023-09-04,000001,Vente,7500,1607,,RTE DE MUR DE SOLOGNE,0200,41230,41268,Veilleins,41,,,412680000D0589,,,,,,,,,,,,,0,3,Dépendance,,0,BR,futaies résineuses,,,6340,1.650531,47.416754
2023-557834,2023-09-22,000001,Vente,65000,,,LA ROCHE,B064,41230,41268,Veilleins,41,,,412680000D0460,,,,,,,,,,,,,0,,,,,BP,peupleraies,,,3145,1.644348,47.413879
2023-557834,2023-09-22,000001,Vente,65000,,,LA ROCHE,B064,41230,41268,Veilleins,41,,,412680000D0460,,,,,,,,,,,,,0,,,,,E,eaux,ETANG,Etangs,7005,1.644348,47.413879
2023-557834,2023-09-22,000001,Vente,65000,,,LA ROCHE,B064,41230,41268,Veilleins,41,,,412680000D0461,,,,,,,,,,,,,0,,,,,BP,peupleraies,,,4220,1.643801,47.414722
2023-557834,2023-09-22,000001,Vente,65000,,,LA ROCHE,B064,41230,41268,Veilleins,41,,,412680000D0461,,,,,,,,,,,,,0,,,,,BR,futaies résineuses,,,3700,1.643801,47.414722
2023-557834,2023-09-22,000001,Vente,65000,,,LA ROCHE,B064,41230,41268,Veilleins,41,,,412680000D0461,,,,,,,,,,,,,0,,,,,E,eaux,ETANG,Etangs,7530,1.643801,47.414722
2023-559260,2023-11-24,000001,Vente,1750000,,,L ETANG PERREUX,B021,41230,41268,Veilleins,41,,,412680000B0060,,,,,,,,,,,,,0,,,,,L,landes,,,5600,1.735803,47.423912
2023-559260,2023-11-24,000001,Vente,1750000,,,L ETANG PERREUX,B021,41230,41268,Veilleins,41,,,412680000B0061,,,,,,,,,,,,,0,,,,,E,eaux,ETANG,Etangs,14320,1.73653,47.423574
2023-559260,2023-11-24,000001,Vente,1750000,,,L ETANG PERREUX,B021,41230,41268,Veilleins,41,,,412680000B0062,,,,,,,,,,,,,0,,,,,L,landes,,,4800,1.736865,47.423359
2023-559260,2023-11-24,000001,Vente,1750000,,,L ETANG PERREUX,B021,41230,41268,Veilleins,41,,,412680000B0063,,,,,,,,,,,,,0,,,,,BT,taillis simples,,,4425,1.738162,47.422708
2023-559260,2023-11-24,000001,Vente,1750000,,,L ETANG PERREUX,B021,41230,41268,Veilleins,41,,,412680000B0063,,,,,,,,,,,,,0,,,,,BT,taillis simples,,,12500,1.738162,47.422708
2023-559260,2023-11-24,000001,Vente,1750000,,,L ETANG PERREUX,B021,41230,41268,Veilleins,41,,,412680000B0063,,,,,,,,,,,,,0,,,,,BS,taillis sous futaie,,,4425,1.738162,47.422708
2023-559260,2023-11-24,000001,Vente,1750000,,,L ETANG PERREUX,B021,41230,41268,Veilleins,41,,,412680000B0064,,,,,,,,,,,,,0,,,,,BT,taillis simples,,,16900,1.738375,47.423593
2023-559260,2023-11-24,000001,Vente,1750000,,,L ETANG PERREUX,B021,41230,41268,Veilleins,41,,,412680000B0065,,,,,,,,,,,,,0,,,,,BT,taillis simples,,,15100,1.740712,47.423249
2023-559260,2023-11-24,000001,Vente,1750000,,,L ETANG PERREUX,B021,41230,41268,Veilleins,41,,,412680000B0066,,,,,,,,,,,,,0,,,,,BT,taillis simples,,,17000,1.740449,47.422227
2023-559863,2023-12-28,000002,Vente,3000,13,,PL DE L EGLISE,0045,41230,41268,Veilleins,41,,,412680000C0631,,,,,,,,,,,,,0,,,,,S,sols,,,32,,
