id_mutation,date_mutation,numero_disposition,nature_mutation,valeur_fonciere,adresse_numero,adresse_suffixe,adresse_nom_voie,adresse_code_voie,code_postal,code_commune,nom_commune,code_departement,ancien_code_commune,ancien_nom_commune,id_parcelle,ancien_id_parcelle,numero_volume,lot1_numero,lot1_surface_carrez,lot2_numero,lot2_surface_carrez,lot3_numero,lot3_surface_carrez,lot4_numero,lot4_surface_carrez,lot5_numero,lot5_surface_carrez,nombre_lots,code_type_local,type_local,surface_reelle_bati,nombre_pieces_principales,code_nature_culture,nature_culture,code_nature_culture_speciale,nature_culture_speciale,surface_terrain,longitude,latitude
2023-551655,2023-01-16,000001,Vente,162121.7,,,LES NOUES,B202,41800,41279,Villedieu-le-Château,41,,,412790000E0022,,,,,,,,,,,,,0,,,,,T,terres,,,81410,0.664624,47.692983
2023-551655,2023-01-16,000001,Vente,162121.7,,,LA BOURSERIE,B044,41800,41279,Villedieu-le-Château,41,,,412790000E0024,,,,,,,,,,,,,0,,,,,T,terres,,,27160,0.661172,47.692962
2023-551655,2023-01-16,000001,Vente,162121.7,,,LA BOURSERIE,B044,41800,41279,Villedieu-le-Château,41,,,412790000E0027,,,,,,,,,,,,,0,,,,,T,terres,,,6340,0.660099,47.694113
2023-551655,2023-01-16,000001,Vente,162121.7,,,LA BOURSERIE,B044,41800,41279,Villedieu-le-Château,41,,,412790000E0029,,,,,,,,,,,,,0,,,,,T,terres,,,895,0.65872,47.694321
2023-551655,2023-01-16,000001,Vente,162121.7,,,LA BOURSERIE,B044,41800,41279,Villedieu-le-Château,41,,,412790000E0030,,,,,,,,,,,,,0,,,,,T,terres,,,760,0.658537,47.694402
2023-551655,2023-01-16,000001,Vente,162121.7,,,LA BOURSERIE,B044,41800,41279,Villedieu-le-Château,41,,,412790000E0031,,,,,,,,,,,,,0,,,,,T,terres,,,2275,0.658749,47.694609
2023-551655,2023-01-16,000001,Vente,162121.7,,,LA BOURSERIE,B044,41800,41279,Villedieu-le-Château,41,,,412790000E0032,,,,,,,,,,,,,0,,,,,T,terres,,,27750,0.65794,47.695128
2023-551655,2023-01-16,000001,Vente,162121.7,,,LA BOURSERIE,B044,41800,41279,Villedieu-le-Château,41,,,412790000E0033,,,,,,,,,,,,,0,,,,,T,terres,,,760,0.656832,47.694755
2023-551655,2023-01-16,000001,Vente,162121.7,,,LA BOURSERIE,B044,41800,41279,Villedieu-le-Château,41,,,412790000E0039,,,,,,,,,,,,,0,,,,,T,terres,,,53580,0.655122,47.693002
2023-551655,2023-01-16,000001,Vente,162121.7,,,LES BLINIERES,B019,41800,41279,Villedieu-le-Château,41,,,412790000E0046,,,,,,,,,,,,,0,,,,,T,terres,,,36660,0.653467,47.68848
2023-551655,2023-01-16,000001,Vente,162121.7,,,LES BLINIERES,B019,41800,41279,Villedieu-le-Château,41,,,412790000E0046,,,,,,,,,,,,,0,,,,,T,terres,,,18330,0.653467,47.68848
2023-551655,2023-01-16,000001,Vente,162121.7,,,LES BLINIERES,B019,41800,41279,Villedieu-le-Château,41,,,412790000E0046,,,,,,,,,,,,,0,,,,,T,terres,,,18330,0.653467,47.68848
2023-551655,2023-01-16,000001,Vente,162121.7,,,LAUDONNERIE,B173,41800,41279,Villedieu-le-Château,41,,,412790000E0059,,,,,,,,,,,,,0,,,,,T,terres,,,7110,0.650887,47.687364
2023-551655,2023-01-16,000001,Vente,162121.7,,,LAUDONNERIE,B173,41800,41279,Villedieu-le-Château,41,,,412790000E0065,,,,,,,,,,,,,0,,,,,T,terres,,,12265,0.651929,47.688641
2023-551655,2023-01-16,000001,Vente,162121.7,,,LAUDONNERIE,B173,41800,41279,Villedieu-le-Château,41,,,412790000E0065,,,,,,,,,,,,,0,,,,,T,terres,,,12265,0.651929,47.688641
2023-551664,2023-01-13,000001,Vente,2000,,,LES HAUTES VIGNES DU FRESN,B159,41800,41279,Villedieu-le-Château,41,,,412790000I0162,,,,,,,,,,,,,0,,,,,T,terres,,,4882,0.603315,47.689154
2023-551664,2023-01-13,000001,Vente,2000,,,LES HAUTES VIGNES DU FRESN,B159,41800,41279,Villedieu-le-Château,41,,,412790000I0205,,,,,,,,,,,,,0,,,,,BT,taillis simples,,,350,0.600349,47.687641
2023-551664,2023-01-13,000001,Vente,2000,,,LES HAUTES VIGNES DU FRESN,B159,41800,41279,Villedieu-le-Château,41,,,412790000I0209,,,,,,,,,,,,,0,,,,,BT,taillis simples,,,882,0.601013,47.687815
2023-551968,2023-01-11,000001,Vente,66500,5,,RUE DU VIEUX CHATEAU,0150,41800,41279,Villedieu-le-Château,41,,,412790000G0585,,,,,,,,,,,,,0,3,Dépendance,,0,S,sols,,,390,0.646655,47.720048
2023-551968,2023-01-11,000001,Vente,66500,5,,RUE DU VIEUX CHATEAU,0150,41800,41279,Villedieu-le-Château,41,,,412790000G0585,,,,,,,,,,,,,0,1,Maison,90,4,S,sols,,,390,0.646655,47.720048
2023-551968,2023-01-11,000001,Vente,66500,5,,RUE DU VIEUX CHATEAU,0150,41800,41279,Villedieu-le-Château,41,,,412790000G0585,,,,,,,,,,,,,0,3,Dépendance,,0,S,sols,,,390,0.646655,47.720048
2023-551968,2023-01-11,000001,Vente,66500,,,LE BOURG,B042,41800,41279,Villedieu-le-Château,41,,,412790000G0586,,,,,,,,,,,,,0,,,,,S,sols,,,28,0.646533,47.720095
2023-551968,2023-01-11,000001,Vente,66500,,,LA MAISON ROUGE,B178,41800,41279,Villedieu-le-Château,41,,,412790000L0318,,,,,,,,,,,,,0,,,,,J,jardins,,,681,0.640054,47.721757
2023-552047,2023-01-25,000001,Vente,75000,,,LES DOUDAINES,B102,41800,41279,Villedieu-le-Château,41,,,412790000A0666,,,,,,,,,,,,,0,,,,,BT,taillis simples,,,6573,0.639939,47.724005
2023-552047,2023-01-25,000001,Vente,75000,,,LES DOUDAINES,B102,41800,41279,Villedieu-le-Château,41,,,412790000A0666,,,,,,,,,,,,,0,,,,,S,sols,,,363,0.639939,47.724005
2023-552047,2023-01-25,000001,Vente,75000,,,LES DOUDAINES,B102,41800,41279,Villedieu-le-Château,41,,,412790000A0667,,,,,,,,,,,,,0,,,,,S,sols,,,129,0.639725,47.723775
2023-552063,2023-02-03,000001,Vente,1000,,,LE CASSEREAU,B059,41800,41279,Villedieu-le-Château,41,,,412790000G0413,,,,,,,,,,,,,0,,,,,S,sols,,,470,0.651864,47.719142
2023-552358,2023-01-25,000001,Vente,1000,,,LE CASSEREAU,B059,41800,41279,Villedieu-le-Château,41,,,412790000G0733,,,,,,,,,,,,,0,,,,,S,sols,,,2,0.65178,47.719294
2023-552714,2023-02-15,000001,Vente,169600,330,,LE CARROIR DE LA FONTAINE,B058,41800,41279,Villedieu-le-Château,41,,,412790000K0362,,,,,,,,,,,,,0,3,Dépendance,,0,S,sols,,,1324,0.593564,47.722167
2023-552714,2023-02-15,000001,Vente,169600,330,,LE CARROIR DE LA FONTAINE,B058,41800,41279,Villedieu-le-Château,41,,,412790000K0362,,,,,,,,,,,,,0,1,Maison,129,4,P,prés,,,1244,0.593564,47.722167
2023-552714,2023-02-15,000001,Vente,169600,330,,LE CARROIR DE LA FONTAINE,B058,41800,41279,Villedieu-le-Château,41,,,412790000K0362,,,,,,,,,,,,,0,3,Dépendance,,0,P,prés,,,1244,0.593564,47.722167
2023-552714,2023-02-15,000001,Vente,169600,330,,LE CARROIR DE LA FONTAINE,B058,41800,41279,Villedieu-le-Château,41,,,412790000K0362,,,,,,,,,,,,,0,1,Maison,129,4,S,sols,,,1324,0.593564,47.722167
2023-552971,2023-03-17,000001,Vente,25000,83,,LE BOURG,B042,41800,41279,Villedieu-le-Château,41,,,412790000G0482,,,,,,,,,,,,,0,3,Dépendance,,0,S,sols,,,514,0.648765,47.719466
2023-552971,2023-03-17,000001,Vente,25000,83,,LE BOURG,B042,41800,41279,Villedieu-le-Château,41,,,412790000G0482,,,,,,,,,,,,,0,3,Dépendance,,0,S,sols,,,514,0.648765,47.719466
2023-553106,2023-03-21,000001,Vente,1900,,,BOIS DE LA MANIBERGE,B025,41800,41279,Villedieu-le-Château,41,,,412790000G0075,,,,,,,,,,,,,0,,,,,BT,taillis simples,,,7885,0.66962,47.716708
2023-553411,2023-03-31,000001,Vente,40203.46,,,LES BOURNAIS,B043,41800,41279,Villedieu-le-Château,41,,,412790000B0447,,,,,,,,,,,,,0,,,,,T,terres,,,1622,0.676236,47.733133
2023-553482,2023-04-05,000001,Vente,1290,,,LES BLINNIERES,B020,41800,41279,Villedieu-le-Château,41,,,412790000I0129,,,,,,,,,,,,,0,,,,,T,terres,,,6440,0.597037,47.697734
2023-553721,2023-04-14,000001,Vente,3542,,,LE CLOS PEAN,B082,41800,41279,Villedieu-le-Château,41,,,412790000A0125,,,,,,,,,,,,,0,,,,,S,sols,,,440,0.646459,47.73467
2023-553721,2023-04-14,000001,Vente,3542,,,LES PERRES DE LA RIBOCHERE,B221,41800,41279,Villedieu-le-Château,41,,,412790000A0362,,,,,,,,,,,,,0,,,,,BT,taillis simples,,,553,0.633222,47.732783
2023-553721,2023-04-14,000001,Vente,3542,,,LA DALLE,B095,41800,41279,Villedieu-le-Château,41,,,412790000K0241,,,,,,,,,,,,,0,,,,,T,terres,,,1973,0.593763,47.705228
2023-553721,2023-04-14,000001,Vente,3542,,,LA DALLE,B095,41800,41279,Villedieu-le-Château,41,,,412790000K0241,,,,,,,,,,,,,0,,,,,T,terres,,,3947,0.593763,47.705228
2023-553758,2023-04-14,000001,Vente,93726,,,LES GLONNIERES,B137,41800,41279,Villedieu-le-Château,41,,,412790000B0328,,,,,,,,,,,,,0,,,,,T,terres,,,10054,0.66056,47.734821
2023-553758,2023-04-14,000001,Vente,93726,,,LES GLONNIERES,B137,41800,41279,Villedieu-le-Château,41,,,412790000B0328,,,,,,,,,,,,,0,,,,,T,terres,,,10054,0.66056,47.734821
2023-553758,2023-04-14,000001,Vente,93726,,,LA FOSSE DUTIER,B124,41800,41279,Villedieu-le-Château,41,,,412790000B0435,,,,,,,,,,,,,0,,,,,T,terres,,,20733,0.673639,47.733427
2023-553758,2023-04-14,000001,Vente,93726,,,LA FOSSE DUTIER,B124,41800,41279,Villedieu-le-Château,41,,,412790000B0435,,,,,,,,,,,,,0,,,,,T,terres,,,62197,0.673639,47.733427
2023-553758,2023-04-14,000001,Vente,93726,,,LA MAUBOITERIE,B184,41800,41279,Villedieu-le-Château,41,,,412790000B0438,,,,,,,,,,,,,0,,,,,T,terres,,,2427,0.676262,47.734697
2023-553758,2023-04-14,000001,Vente,93726,,,LES BOURNAIS,B043,41800,41279,Villedieu-le-Château,41,,,412790000B0439,,,,,,,,,,,,,0,,,,,T,terres,,,8678,0.677686,47.734982
2023-553758,2023-04-14,000001,Vente,93726,,,BOIS DE LA MANIBERGE,B025,41800,41279,Villedieu-le-Château,41,,,412790000G0065,,,,,,,,,,,,,0,,,,,T,terres,,,7890,0.669281,47.720279
2023-553761,2023-04-14,000001,Vente,103728.8,,,LES LANDES DU VERDEAU,B172,41800,41279,Villedieu-le-Château,41,,,412790000B0129,,,,,,,,,,,,,0,,,,,T,terres,,,7135,0.663007,47.738721
2023-553761,2023-04-14,000001,Vente,103728.8,,,LA FOSSE NOIRE,B125,41800,41279,Villedieu-le-Château,41,,,412790000B0226,,,,,,,,,,,,,0,,,,,T,terres,,,3830,0.663839,47.736627
2023-553761,2023-04-14,000001,Vente,103728.8,,,LA PIERRE PERCEE,B240,41800,41279,Villedieu-le-Château,41,,,412790000B0307,,,,,,,,,,,,,0,,,,,T,terres,,,38790,0.664376,47.730654
2023-553761,2023-04-14,000001,Vente,103728.8,,,LES PERRES,B219,41800,41279,Villedieu-le-Château,41,,,412790000B0310,,,,,,,,,,,,,0,,,,,T,terres,,,8240,0.662876,47.733798
2023-553761,2023-04-14,000001,Vente,103728.8,,,LES PERRES,B219,41800,41279,Villedieu-le-Château,41,,,412790000B0311,,,,,,,,,,,,,0,,,,,T,terres,,,2829,0.663375,47.733232
2023-553761,2023-04-14,000001,Vente,103728.8,,,LES PERRES,B219,41800,41279,Villedieu-le-Château,41,,,412790000B0312,,,,,,,,,,,,,0,,,,,T,terres,,,2738,0.662427,47.733599
2023-553761,2023-04-14,000001,Vente,103728.8,,,LES PERRES,B219,41800,41279,Villedieu-le-Château,41,,,412790000B0314,,,,,,,,,,,,,0,,,,,T,terres,,,1938,0.661564,47.733006
2023-553761,2023-04-14,000001,Vente,103728.8,,,LES PERRES,B219,41800,41279,Villedieu-le-Château,41,,,412790000B0315,,,,,,,,,,,,,0,,,,,T,terres,,,8471,0.662697,47.733021
2023-553761,2023-04-14,000001,Vente,103728.8,,,LA MONTENARDERIE,B193,41800,41279,Villedieu-le-Château,41,,,412790000B0354,,,,,,,,,,,,,0,,,,,T,terres,,,44075,0.667499,47.727953
2023-553761,2023-04-14,000001,Vente,103728.8,,,LA MONTENARDERIE,B193,41800,41279,Villedieu-le-Château,41,,,412790000B0354,,,,,,,,,,,,,0,,,,,T,terres,,,44075,0.667499,47.727953
2023-553761,2023-04-14,000001,Vente,103728.8,,,LE TROT,B293,41800,41279,Villedieu-le-Château,41,,,412790000B0518,,,,,,,,,,,,,0,,,,,T,terres,,,10462,0.666651,47.731062
2023-553761,2023-04-14,000001,Vente,103728.8,,,LE TROT,B293,41800,41279,Villedieu-le-Château,41,,,412790000B0518,,,,,,,,,,,,,0,,,,,T,terres,,,20923,0.666651,47.731062
2023-553761,2023-04-14,000001,Vente,103728.8,,,LES EPINETS,B109,41800,41279,Villedieu-le-Château,41,,,412790000G0010,,,,,,,,,,,,,0,,,,,T,terres,,,5438,0.652814,47.724465
2023-553761,2023-04-14,000001,Vente,103728.8,,,LES EPINETS,B109,41800,41279,Villedieu-le-Château,41,,,412790000G0011,,,,,,,,,,,,,0,,,,,T,terres,,,5305,0.652911,47.724025
2023-553761,2023-04-14,000001,Vente,103728.8,,,LES EPINETS,B109,41800,41279,Villedieu-le-Château,41,,,412790000G0017,,,,,,,,,,,,,0,,,,,T,terres,,,15260,0.653313,47.722881
2023-553761,2023-04-14,000001,Vente,103728.8,,,LES EPINETS,B109,41800,41279,Villedieu-le-Château,41,,,412790000G0017,,,,,,,,,,,,,0,,,,,T,terres,,,15260,0.653313,47.722881
2023-553839,2023-04-21,000001,Vente,1000,,,LA HERISSIERE,B162,41800,41279,Villedieu-le-Château,41,,,412790000D0009,,,,,,,,,,,,,0,,,,,BT,taillis simples,,,2860,0.666979,47.713375
2023-554460,2023-04-27,000001,Vente,50000,22,,RUE DU PONT BODIN,0104,41800,41279,Villedieu-le-Château,41,,,412790000G0375,,,,,,,,,,,,,0,1,Maison,110,3,S,sols,,,567,0.648948,47.72126
2023-554460,2023-04-27,000001,Vente,50000,22,,RUE DU PONT BODIN,0104,41800,41279,Villedieu-le-Château,41,,,412790000G0375,,,,,,,,,,,,,0,3,Dépendance,,0,S,sols,,,567,0.648948,47.72126
2023-554460,2023-04-27,000001,Vente,50000,,,LE BOURG,B042,41800,41279,Villedieu-le-Château,41,,,412790000G0501,,,,,,,,,,,,,0,,,,,J,jardins,,,458,0.648653,47.721006
2023-554460,2023-04-27,000001,Vente,50000,,,LE BOURG,B042,41800,41279,Villedieu-le-Château,41,,,412790000G0502,,,,,,,,,,,,,0,,,,,J,jardins,,,200,0.648405,47.721096
2023-554460,2023-04-27,000001,Vente,50000,,,PONT BODIN,B250,41800,41279,Villedieu-le-Château,41,,,412790000G0674,,,,,,,,,,,,,0,,,,,S,sols,,,59,0.648779,47.721287
2023-554460,2023-04-27,000001,Vente,50000,,,PONT BODIN,B250,41800,41279,Villedieu-le-Château,41,,,412790000G0675,,,,,,,,,,,,,0,,,,,T,terres,,,12,0.64917,47.721452
2023-554460,2023-04-27,000001,Vente,50000,,,PONT BODIN,B250,41800,41279,Villedieu-le-Château,41,,,412790000G0677,,,,,,,,,,,,,0,,,,,T,terres,,,1408,0.649503,47.721447
2023-554460,2023-04-27,000001,Vente,50000,,,PONT BODIN,B250,41800,41279,Villedieu-le-Château,41,,,412790000G0744,,,,,,,,,,,,,0,,,,,S,sols,,,215,0.649248,47.721287
2023-554661,2023-05-23,000001,Vente,4500,,,LE VERDEAU,B302,41800,41279,Villedieu-le-Château,41,,,412790000B0097,,,,,,,,,,,,,0,,,,,T,terres,,,883,0.659123,47.739725
2023-554661,2023-05-23,000001,Vente,4500,,,LES LANDES DU VERDEAU,B172,41800,41279,Villedieu-le-Château,41,,,412790000B0127,,,,,,,,,,,,,0,,,,,BT,taillis simples,,,1754,0.664335,47.739264
2023-554874,2023-06-06,000001,Vente,190000,5003,,LA DINDORIERE,B099,41800,41279,Villedieu-le-Château,41,,,412790000B0017,,,,,,,,,,,,,0,3,Dépendance,,0,S,sols,,,705,0.654926,47.739857
2023-554874,2023-06-06,000001,Vente,190000,5003,,LA DINDORIERE,B099,41800,41279,Villedieu-le-Château,41,,,412790000B0017,,,,,,,,,,,,,0,3,Dépendance,,0,S,sols,,,705,0.654926,47.739857
2023-554874,2023-06-06,000001,Vente,190000,,,LA DINDORIERE,B099,41800,41279,Villedieu-le-Château,41,,,412790000B0018,,,,,,,,,,,,,0,,,,,L,landes,,,691,0.655161,47.740042
2023-554874,2023-06-06,000001,Vente,190000,,,LA DINDORIERE,B099,41800,41279,Villedieu-le-Château,41,,,412790000B0046,,,,,,,,,,,,,0,,,,,S,sols,,,138,0.655699,47.739841
2023-554874,2023-06-06,000001,Vente,190000,,,LA DINDORIERE,B099,41800,41279,Villedieu-le-Château,41,,,412790000B0049,,,,,,,,,,,,,0,,,,,BT,taillis simples,,,945,0.65542,47.739619
2023-554874,2023-06-06,000001,Vente,190000,,,LA DINDORIERE,B099,41800,41279,Villedieu-le-Château,41,,,412790000B0049,,,,,,,,,,,,,0,,,,,S,sols,,,136,0.65542,47.739619
2023-554874,2023-06-06,000001,Vente,190000,5001,,LA DINDORIERE,B099,41800,41279,Villedieu-le-Château,41,,,412790000B0050,,,,,,,,,,,,,0,1,Maison,185,5,S,sols,,,510,0.655122,47.739636
2023-554874,2023-06-06,000001,Vente,190000,,,LA DINDORIERE,B099,41800,41279,Villedieu-le-Château,41,,,412790000B0051,,,,,,,,,,,,,0,,,,,BT,taillis simples,,,1325,0.65521,47.73951
2023-554874,2023-06-06,000001,Vente,190000,,,LA DINDORIERE,B099,41800,41279,Villedieu-le-Château,41,,,412790000B0052,,,,,,,,,,,,,0,,,,,BT,taillis simples,,,1820,0.654864,47.7393
2023-554874,2023-06-06,000001,Vente,190000,,,LA DINDORIERE,B099,41800,41279,Villedieu-le-Château,41,,,412790000B0054,,,,,,,,,,,,,0,,,,,BT,taillis simples,,,626,0.654372,47.739267
2023-554874,2023-06-06,000001,Vente,190000,,,LA DINDORIERE,B099,41800,41279,Villedieu-le-Château,41,,,412790000B0069,,,,,,,,,,,,,0,,,,,BT,taillis simples,,,459,0.654891,47.739008
2023-554874,2023-06-06,000001,Vente,190000,,,LA DINDORIERE,B099,41800,41279,Villedieu-le-Château,41,,,412790000B0072,,,,,,,,,,,,,0,,,,,BT,taillis simples,,,474,0.655855,47.739096
2023-554874,2023-06-06,000001,Vente,190000,,,LA DINDORIERE,B099,41800,41279,Villedieu-le-Château,41,,,412790000B0082,,,,,,,,,,,,,0,,,,,BT,taillis simples,,,1304,0.65876,47.740213
2023-555145,2023-06-19,000001,Vente,70000,,,LE BOURG,B042,41800,41279,Villedieu-le-Château,41,,,412790000G0504,,,,,,,,,,,,,0,,,,,J,jardins,,,584,0.648398,47.720858
2023-555145,2023-06-19,000001,Vente,70000,46,,LE BOURG,B042,41800,41279,Villedieu-le-Château,41,,,412790000G0534,,,,,,,,,,,,,0,3,Dépendance,,0,S,sols,,,48,0.647372,47.720059
2023-555145,2023-06-19,000001,Vente,70000,46,,LE BOURG,B042,41800,41279,Villedieu-le-Château,41,,,412790000G0534,,,,,,,,,,,,,0,3,Dépendance,,0,S,sols,,,48,0.647372,47.720059
2023-555145,2023-06-19,000001,Vente,70000,46,,LE BOURG,B042,41800,41279,Villedieu-le-Château,41,,,412790000G0534,,,,,,,,,,,,,0,3,Dépendance,,0,S,sols,,,48,0.647372,47.720059
2023-555145,2023-06-19,000001,Vente,70000,1,,RUE DU VIEUX CHATEAU,0150,41800,41279,Villedieu-le-Château,41,,,412790000G0583,,,,,,,,,,,,,0,1,Maison,82,3,S,sols,,,197,0.647018,47.719876
2023-555145,2023-06-19,000001,Vente,70000,,,LE BOURG,B042,41800,41279,Villedieu-le-Château,41,,,412790000G0710,,,,,,,,,,,,,0,,,,,S,sols,,,55,0.647296,47.719991
2023-556551,2023-08-07,000001,Vente,1000,,,LES VEAUX EST,B299,41800,41279,Villedieu-le-Château,41,,,412790000L0009,,,,,,,,,,,,,0,,,,,BT,taillis simples,,,172,0.611716,47.7274
2023-556630,2023-08-10,000001,Vente,120000,344,,LES BOURDINERIES,B040,41800,41279,Villedieu-le-Château,41,,,412790000B0480,,,,,,,,,,,,,0,3,Dépendance,,0,S,sols,,,381,0.681285,47.732502
2023-556630,2023-08-10,000001,Vente,120000,344,,LES BOURDINERIES,B040,41800,41279,Villedieu-le-Château,41,,,412790000B0480,,,,,,,,,,,,,0,3,Dépendance,,0,BT,taillis simples,,,2038,0.681285,47.732502
2023-556630,2023-08-10,000001,Vente,120000,344,,LES BOURDINERIES,B040,41800,41279,Villedieu-le-Château,41,,,412790000B0480,,,,,,,,,,,,,0,1,Maison,64,2,S,sols,,,381,0.681285,47.732502
2023-556630,2023-08-10,000001,Vente,120000,344,,LES BOURDINERIES,B040,41800,41279,Villedieu-le-Château,41,,,412790000B0480,,,,,,,,,,,,,0,3,Dépendance,,0,S,sols,,,381,0.681285,47.732502
2023-556630,2023-08-10,000001,Vente,120000,344,,LES BOURDINERIES,B040,41800,41279,Villedieu-le-Château,41,,,412790000B0480,,,,,,,,,,,,,0,3,Dépendance,,0,BT,taillis simples,,,2038,0.681285,47.732502
2023-556630,2023-08-10,000001,Vente,120000,344,,LES BOURDINERIES,B040,41800,41279,Villedieu-le-Château,41,,,412790000B0480,,,,,,,,,,,,,0,1,Maison,64,2,BT,taillis simples,,,2038,0.681285,47.732502
2023-556630,2023-08-10,000001,Vente,120000,,,LES BOURDINERIES,B040,41800,41279,Villedieu-le-Château,41,,,412790000B0481,,,,,,,,,,,,,0,,,,,BT,taillis simples,,,2532,0.681425,47.732311
2023-556980,2023-08-17,000001,Vente,50,,,LES MOLLIERES,B192,41800,41279,Villedieu-le-Château,41,,,412790000L0418,,,,,,,,,,,,,0,,,,,T,terres,,,521,0.634734,47.722101
2023-557090,2023-08-28,000001,Vente,4000,,,LA RIBOCHERE,B258,41800,41279,Villedieu-le-Château,41,,,412790000A0821,,,,,,,,,,,,,0,,,,,S,sols,,,4,0.651176,47.737999
2023-557090,2023-08-28,000001,Vente,4000,,,LA RIBOCHERE,B258,41800,41279,Villedieu-le-Château,41,,,412790000A0855,,,,,,,,,,,,,0,,,,,BT,taillis simples,,,315,0.651215,47.738015
2023-557174,2023-09-05,000001,Vente,25000,2,,RUE DU PONT BODIN,0104,41800,41279,Villedieu-le-Château,41,,,412790000G0352,,,,,,,,,,,,,0,1,Maison,42,1,S,sols,,,118,0.650096,47.719928
2023-557174,2023-09-05,000001,Vente,25000,,,PONT BODIN,B250,41800,41279,Villedieu-le-Château,41,,,412790000G0667,,,,,,,,,,,,,0,,,,,S,sols,,,3,0.650302,47.720007
2023-557174,2023-09-05,000001,Vente,25000,,,PONT BODIN,B250,41800,41279,Villedieu-le-Château,41,,,412790000G0670,,,,,,,,,,,,,0,,,,,S,sols,,,4,0.650301,47.719904
2023-557174,2023-09-05,000001,Vente,25000,,,PONT BODIN,B250,41800,41279,Villedieu-le-Château,41,,,412790000G0678,,,,,,,,,,,,,0,,,,,J,jardins,,,308,0.650225,47.719871
2023-557632,2023-09-26,000001,Vente,35000,16,,RUE DU PONT BODIN,0104,41800,41279,Villedieu-le-Château,41,,,412790000G0745,,,,,,,,,,,,,0,3,Dépendance,,0,S,sols,,,12,0.649158,47.72093
2023-557632,2023-09-26,000001,Vente,35000,,,PONT BODIN,B250,41800,41279,Villedieu-le-Château,41,,,412790000G0746,,,,,,,,,,,,,0,,,,,S,sols,,,21,0.649281,47.721137
2023-557632,2023-09-26,000001,Vente,35000,16,,RUE DU PONT BODIN,0104,41800,41279,Villedieu-le-Château,41,,,412790000G0749,,,,,,,,,,,,,0,1,Maison,51,3,S,sols,,,129,0.64933,47.720969
2023-557632,2023-09-26,000001,Vente,35000,,,PONT BODIN,B250,41800,41279,Villedieu-le-Château,41,,,412790000G0752,,,,,,,,,,,,,0,,,,,S,sols,,,360,0.649267,47.721034
2023-557737,2023-09-28,000001,Vente,500,5001,,CHATEAU GAILLARD,B067,41800,41279,Villedieu-le-Château,41,,,412790000A0668,,,,,,,,,,,,,0,3,Dépendance,,0,L,landes,,,320,0.639232,47.724331
2023-558771,2023-11-16,000001,Vente,130000,348,,LA MAISON ROUGE,B178,41800,41279,Villedieu-le-Château,41,,,412790000L0559,,,,,,,,,,,,,0,1,Maison,89,4,AG,terrains d'agrément,,,2711,0.640644,47.721598
2023-558771,2023-11-16,000001,Vente,130000,348,,LA MAISON ROUGE,B178,41800,41279,Villedieu-le-Château,41,,,412790000L0559,,,,,,,,,,,,,0,3,Dépendance,,0,AG,terrains d'agrément,,,2711,0.640644,47.721598
2023-558771,2023-11-16,000001,Vente,130000,348,,LA MAISON ROUGE,B178,41800,41279,Villedieu-le-Château,41,,,412790000L0559,,,,,,,,,,,,,0,1,Maison,89,4,S,sols,,,745,0.640644,47.721598
2023-558771,2023-11-16,000001,Vente,130000,348,,LA MAISON ROUGE,B178,41800,41279,Villedieu-le-Château,41,,,412790000L0559,,,,,,,,,,,,,0,3,Dépendance,,0,S,sols,,,745,0.640644,47.721598
2023-559171,2023-11-17,000001,Vente,6050,,,LES PERCHES,B215,41800,41279,Villedieu-le-Château,41,,,412790000I0140,,,,,,,,,,,,,0,,,,,T,terres,,,6840,0.603962,47.693364
2023-559171,2023-11-17,000001,Vente,6050,,,LES PERCHES,B215,41800,41279,Villedieu-le-Château,41,,,412790000I0140,,,,,,,,,,,,,0,,,,,T,terres,,,20520,0.603962,47.693364
2023-559171,2023-11-17,000001,Vente,6050,,,LES HAUTES VIGNES DU FRESN,B159,41800,41279,Villedieu-le-Château,41,,,412790000I0177,,,,,,,,,,,,,0,,,,,T,terres,,,533,0.598334,47.687609
2023-559171,2023-11-17,000001,Vente,6050,,,LES HAUTES VIGNES DU FRESN,B159,41800,41279,Villedieu-le-Château,41,,,412790000I0190,,,,,,,,,,,,,0,,,,,T,terres,,,875,0.597296,47.688589
2023-559171,2023-11-17,000001,Vente,6050,,,LES HAUTES VIGNES DU FRESN,B159,41800,41279,Villedieu-le-Château,41,,,412790000I0213,,,,,,,,,,,,,0,,,,,BT,taillis simples,,,690,0.601002,47.687531
2023-559171,2023-11-17,000001,Vente,6050,,,LA HAUTE COTINIERE,B158,41800,41279,Villedieu-le-Château,41,,,412790000K0238,,,,,,,,,,,,,0,,,,,T,terres,,,4236,0.59506,47.704425
2023-559719,2023-12-29,000001,Vente,18000,,,LA PENILLERE,B213,41800,41279,Villedieu-le-Château,41,,,412790000G0136,,,,,,,,,,,,,0,,,,,S,sols,,,51,0.664301,47.718525
2023-559719,2023-12-29,000001,Vente,18000,,,LA PENILLERE,B213,41800,41279,Villedieu-le-Château,41,,,412790000G0139,,,,,,,,,,,,,0,,,,,S,sols,,,302,0.664063,47.718435
2023-559719,2023-12-29,000001,Vente,18000,,,LA PENILLERE,B213,41800,41279,Villedieu-le-Château,41,,,412790000G0141,,,,,,,,,,,,,0,,,,,BT,taillis simples,,,1296,0.664017,47.718768
2023-559719,2023-12-29,000001,Vente,18000,,,LA PENILLERE,B213,41800,41279,Villedieu-le-Château,41,,,412790000G0892,,,,,,,,,,,,,0,,,,,T,terres,,,425,0.664209,47.718321
2023-559719,2023-12-29,000001,Vente,18000,,,LA PENILLERE,B213,41800,41279,Villedieu-le-Château,41,,,412790000G0894,,,,,,,,,,,,,0,,,,,T,terres,,,645,0.663962,47.718263
2023-559907,2023-12-20,000001,Vente,49787,,,LA VALLEE AUX CLERCS,B294,41800,41279,Villedieu-le-Château,41,,,412790000B0170,,,,,,,,,,,,,0,,,,,BT,taillis simples,,,871,0.665139,47.738768
