id_mutation,date_mutation,numero_disposition,nature_mutation,valeur_fonciere,adresse_numero,adresse_suffixe,adresse_nom_voie,adresse_code_voie,code_postal,code_commune,nom_commune,code_departement,ancien_code_commune,ancien_nom_commune,id_parcelle,ancien_id_parcelle,numero_volume,lot1_numero,lot1_surface_carrez,lot2_numero,lot2_surface_carrez,lot3_numero,lot3_surface_carrez,lot4_numero,lot4_surface_carrez,lot5_numero,lot5_surface_carrez,nombre_lots,code_type_local,type_local,surface_reelle_bati,nombre_pieces_principales,code_nature_culture,nature_culture,code_nature_culture_speciale,nature_culture_speciale,surface_terrain,longitude,latitude
2023-616296,2023-02-03,000001,Vente,44250,,,LE GRAND BREAU,B023,45170,45325,Tivernon,45,,,45325000ZE0012,,,,,,,,,,,,,0,,,,,T,terres,,,1670,1.957701,48.155424
2023-617569,2023-03-03,000001,Vente,266000,12,,LES OUCHES D ONDREVILLE,B026,45170,45325,Tivernon,45,,,453250000B0057,,,,,,,,,,,,,0,1,Maison,163,6,S,sols,,,709,1.953786,48.173345
2023-617569,2023-03-03,000001,Vente,266000,,,LA BUTTE DE CHAUSSY,B009,45170,45325,Tivernon,45,,,453250000B0233,,,,,,,,,,,,,0,,,,,S,sols,,,340,1.954067,48.17323
2023-617569,2023-03-03,000001,Vente,266000,,,LA BUTTE DE CHAUSSY,B009,45170,45325,Tivernon,45,,,453250000B0235,,,,,,,,,,,,,0,,,,,S,sols,,,71,1.953959,48.173382
2023-617645,2023-03-20,000001,Vente,32500,,,LES BARBITONS,B003,45170,45325,Tivernon,45,,,45325000ZM0015,,,,,,,,,,,,,0,,,,,T,terres,,,16000,1.911632,48.156693
2023-617645,2023-03-20,000001,Vente,32500,,,LES BARBITONS,B003,45170,45325,Tivernon,45,,,45325000ZM0015,,,,,,,,,,,,,0,,,,,T,terres,,,31000,1.911632,48.156693
2023-617645,2023-03-20,000001,Vente,32500,,,LES BARBITONS,B003,45170,45325,Tivernon,45,,,45325000ZM0015,,,,,,,,,,,,,0,,,,,T,terres,,,3180,1.911632,48.156693
2023-617730,2023-03-16,000001,Vente,3902.5,,,LE GRAND MARJANVILLE,B042,45170,45325,Tivernon,45,,,45325000ZL0047,,,,,,,,,,,,,0,,,,,T,terres,,,5575,1.907845,48.156704
2023-621269,2023-06-15,000001,Vente,149800,,,LE BOURG,B008,45170,45325,Tivernon,45,,,453250000E0214,,,,,,,,,,,,,0,,,,,J,jardins,,,809,1.932779,48.154634
2023-621269,2023-06-15,000001,Vente,149800,7,,RUE DU MONCEAU,0060,45170,45325,Tivernon,45,,,453250000E0312,,,,,,,,,,,,,0,1,Maison,134,4,S,sols,,,272,1.932442,48.154671
2023-623109,2023-07-24,000001,Vente,170000,,,LES OUCHES D ONDREVILLE,B026,45170,45325,Tivernon,45,,,45325000ZC0023,,,,,,,,,,,,,0,,,,,T,terres,,,30,1.952121,48.169568
2023-623109,2023-07-24,000001,Vente,170000,1,,LES OUCHES D ONDREVILLE,B026,45170,45325,Tivernon,45,,,45325000ZC0040,,,,,,,,,,,,,0,1,Maison,80,3,S,sols,,,649,1.952181,48.169462
2023-623109,2023-07-24,000001,Vente,170000,1,,LES OUCHES D ONDREVILLE,B026,45170,45325,Tivernon,45,,,45325000ZC0040,,,,,,,,,,,,,0,3,Dépendance,,0,S,sols,,,649,1.952181,48.169462
2023-623109,2023-07-24,000001,Vente,170000,,,VALLEE DE TOURY,B036,45170,45325,Tivernon,45,,,45325000ZC0043,,,,,,,,,,,,,0,,,,,J,jardins,,,220,1.951964,48.169448
2023-623109,2023-07-24,000001,Vente,170000,,,VALLEE DE TOURY,B036,45170,45325,Tivernon,45,,,45325000ZC0044,,,,,,,,,,,,,0,,,,,J,jardins,,,8,1.95213,48.169243
2023-626635,2023-11-06,000001,Vente,162500,5058,,LE BOURG,B008,45170,45325,Tivernon,45,,,453250000E0205,,,,,,,,,,,,,0,1,Maison,74,3,S,sols,,,498,1.929405,48.15631
2023-626635,2023-11-06,000001,Vente,162500,,,LE BOURG,B008,45170,45325,Tivernon,45,,,453250000E0206,,,,,,,,,,,,,0,,,,,S,sols,,,22,1.929353,48.156364
2023-626635,2023-11-06,000001,Vente,162500,,,LE BOURG,B008,45170,45325,Tivernon,45,,,453250000E0207,,,,,,,,,,,,,0,,,,,S,sols,,,50,1.929316,48.156312
2023-627204,2023-11-13,000001,Vente,98000,5007,,RUE DU GOUANON,0020,45170,45325,Tivernon,45,,,453250000E0052,,,,,,,,,,,,,0,3,Dépendance,,0,S,sols,,,298,1.93257,48.155998
2023-627204,2023-11-13,000001,Vente,98000,5007,,RUE DU GOUANON,0020,45170,45325,Tivernon,45,,,453250000E0052,,,,,,,,,,,,,0,3,Dépendance,,0,S,sols,,,298,1.93257,48.155998
2023-627204,2023-11-13,000001,Vente,98000,5007,,RUE DU GOUANON,0020,45170,45325,Tivernon,45,,,453250000E0052,,,,,,,,,,,,,0,1,Maison,44,3,S,sols,,,298,1.93257,48.155998
2023-628258,2023-12-18,000001,Vente,192000,,,LE BOURG,B008,45170,45325,Tivernon,45,,,453250000E0049,,,,,,,,,,,,,0,,,,,J,jardins,,,442,1.932546,48.156394
2023-628258,2023-12-18,000001,Vente,192000,5006,,LE BOURG,B008,45170,45325,Tivernon,45,,,453250000E0300,,,,,,,,,,,,,0,3,Dépendance,,0,S,sols,,,75,1.93256,48.156227
2023-628258,2023-12-18,000001,Vente,192000,5006,,LE BOURG,B008,45170,45325,Tivernon,45,,,453250000E0300,,,,,,,,,,,,,0,1,Maison,68,2,S,sols,,,75,1.93256,48.156227
2023-628258,2023-12-18,000001,Vente,192000,5006,,LE BOURG,B008,45170,45325,Tivernon,45,,,453250000E0300,,,,,,,,,,,,,0,3,Dépendance,,0,S,sols,,,75,1.93256,48.156227
2023-628258,2023-12-18,000001,Vente,192000,,,LE BOURG,B008,45170,45325,Tivernon,45,,,453250000E0301,,,,,,,,,,,,,0,,,,,S,sols,,,42,1.932369,48.156101
2023-628258,2023-12-18,000001,Vente,192000,,,LE BOURG,B008,45170,45325,Tivernon,45,,,453250000E0318,,,,,,,,,,,,,0,,,,,S,sols,,,387,1.932522,48.156138
