id_mutation,date_mutation,numero_disposition,nature_mutation,valeur_fonciere,adresse_numero,adresse_suffixe,adresse_nom_voie,adresse_code_voie,code_postal,code_commune,nom_commune,code_departement,ancien_code_commune,ancien_nom_commune,id_parcelle,ancien_id_parcelle,numero_volume,lot1_numero,lot1_surface_carrez,lot2_numero,lot2_surface_carrez,lot3_numero,lot3_surface_carrez,lot4_numero,lot4_surface_carrez,lot5_numero,lot5_surface_carrez,nombre_lots,code_type_local,type_local,surface_reelle_bati,nombre_pieces_principales,code_nature_culture,nature_culture,code_nature_culture_speciale,nature_culture_speciale,surface_terrain,longitude,latitude
2023-634270,2023-01-24,000001,Vente,145000,110,,RTE DE COSTY,0016,47800,47003,Agnac,47,,,470030000A0408,,,,,,,,,,,,,0,3,Dépendance,,0,S,sols,,,171,0.353309,44.645636
2023-634270,2023-01-24,000001,Vente,145000,110,,RTE DE COSTY,0016,47800,47003,Agnac,47,,,470030000A0408,,,,,,,,,,,,,0,1,Maison,70,3,S,sols,,,171,0.353309,44.645636
2023-634270,2023-01-24,000001,Vente,145000,,,COSTY,B030,47800,47003,Agnac,47,,,470030000A0409,,,,,,,,,,,,,0,,,,,P,prés,,,393,0.353159,44.645501
2023-634270,2023-01-24,000001,Vente,145000,,,COSTY,B030,47800,47003,Agnac,47,,,470030000A0409,,,,,,,,,,,,,0,,,,,S,sols,,,187,0.353159,44.645501
2023-634270,2023-01-24,000001,Vente,145000,,,COSTY,B030,47800,47003,Agnac,47,,,470030000A0653,,,,,,,,,,,,,0,,,,,S,sols,,,370,0.353016,44.645611
2023-634270,2023-01-24,000001,Vente,145000,,,COSTY,B030,47800,47003,Agnac,47,,,470030000A0653,,,,,,,,,,,,,0,,,,,P,prés,,,744,0.353016,44.645611
2023-634270,2023-01-24,000001,Vente,145000,,,LA GARE,B034,47800,47003,Agnac,47,,,470030000A0657,,,,,,,,,,,,,0,,,,,J,jardins,POTAG,Jardin potager,145,0.352661,44.645348
2023-634291,2023-01-13,000002,Echange,40,,,LANAUZE,B055,47800,47003,Agnac,47,,,470030000A1432,,,,,,,,,,,,,0,,,,,T,terres,,,54,0.357023,44.650909
2023-634468,2023-01-27,000001,Vente,188000,,,PRES DU BOURG,B080,47800,47003,Agnac,47,,,470030000B0712,,,,,,,,,,,,,0,,,,,T,terres,,,478,0.373102,44.652683
2023-634468,2023-01-27,000001,Vente,188000,,,PRES DU BOURG,B080,47800,47003,Agnac,47,,,470030000B0712,,,,,,,,,,,,,0,,,,,T,terres,,,477,0.373102,44.652683
2023-634468,2023-01-27,000001,Vente,188000,,,PRES DE TOUT LE MONDE,B079,47800,47003,Agnac,47,,,470030000B0946,,,,,,,,,,,,,0,,,,,P,prés,,,299,0.376087,44.652663
2023-634468,2023-01-27,000001,Vente,188000,,,PRES DU BOURG,B080,47800,47003,Agnac,47,,,470030000B0948,,,,,,,,,,,,,0,,,,,T,terres,,,71,0.373877,44.652617
2023-634468,2023-01-27,000001,Vente,188000,,,PRES DU BOURG,B080,47800,47003,Agnac,47,,,470030000B0950,,,,,,,,,,,,,0,,,,,BT,taillis simples,,,842,0.374319,44.65267
2023-634468,2023-01-27,000001,Vente,188000,40,,RTE DE L'EGLISE,0019,47800,47003,Agnac,47,,,470030000B0952,,,,,,,,,,,,,0,1,Maison,172,6,AG,terrains d'agrément,,,2692,0.373495,44.652531
2023-634468,2023-01-27,000001,Vente,188000,40,,RTE DE L'EGLISE,0019,47800,47003,Agnac,47,,,470030000B0952,,,,,,,,,,,,,0,1,Maison,172,6,S,sols,,,1000,0.373495,44.652531
2023-634468,2023-01-27,000001,Vente,188000,,,PRES DU BOURG,B080,47800,47003,Agnac,47,,,470030000B0954,,,,,,,,,,,,,0,3,Dépendance,,0,T,terres,,,3217,0.374916,44.652753
2023-634468,2023-01-27,000001,Vente,188000,,,PRES DU BOURG,B080,47800,47003,Agnac,47,,,470030000B0954,,,,,,,,,,,,,0,3,Dépendance,,0,S,sols,,,1000,0.374916,44.652753
2023-634643,2023-01-27,000001,Vente,270000,,,AU PINQUA,B070,47800,47003,Agnac,47,,,470030000A0541,,,,,,,,,,,,,0,,,,,BT,taillis simples,,,665,0.352969,44.641053
2023-634643,2023-01-27,000001,Vente,270000,,,AU PINQUA,B070,47800,47003,Agnac,47,,,470030000A0541,,,,,,,,,,,,,0,,,,,S,sols,,,255,0.352969,44.641053
2023-634643,2023-01-27,000001,Vente,270000,,,AU PINQUA,B070,47800,47003,Agnac,47,,,470030000A0742,,,,,,,,,,,,,0,,,,,L,landes,,,5440,0.35161,44.641179
2023-634643,2023-01-27,000001,Vente,270000,,,AU PINQUA,B070,47800,47003,Agnac,47,,,470030000A0759,,,,,,,,,,,,,0,,,,,L,landes,,,5695,0.352248,44.641068
2023-634643,2023-01-27,000001,Vente,270000,,,AU PINQUA,B070,47800,47003,Agnac,47,,,470030000A1436,,,,,,,,,,,,,0,,,,,AG,terrains d'agrément,,,1846,0.352765,44.640799
2023-634643,2023-01-27,000001,Vente,270000,390,,IMP DU PINQUA,0010,47800,47003,Agnac,47,,,470030000A1438,,,,,,,,,,,,,0,3,Dépendance,,0,AG,terrains d'agrément,,,1703,0.353182,44.640952
2023-634643,2023-01-27,000001,Vente,270000,390,,IMP DU PINQUA,0010,47800,47003,Agnac,47,,,470030000A1438,,,,,,,,,,,,,0,1,Maison,280,6,S,sols,,,1000,0.353182,44.640952
2023-634643,2023-01-27,000001,Vente,270000,390,,IMP DU PINQUA,0010,47800,47003,Agnac,47,,,470030000A1438,,,,,,,,,,,,,0,3,Dépendance,,0,S,sols,,,1000,0.353182,44.640952
2023-634643,2023-01-27,000001,Vente,270000,390,,IMP DU PINQUA,0010,47800,47003,Agnac,47,,,470030000A1438,,,,,,,,,,,,,0,1,Maison,280,6,AG,terrains d'agrément,,,1703,0.353182,44.640952
2023-635381,2023-03-07,000001,Vente,14440,,,PRE DE LA REGIE,B077,47800,47003,Agnac,47,,,470030000A0966,,,,,,,,,,,,,0,,,,,T,terres,,,1618,0.354483,44.651249
2023-635381,2023-03-07,000001,Vente,14440,,,PRE DE LA REGIE,B077,47800,47003,Agnac,47,,,470030000A0969,,,,,,,,,,,,,0,,,,,T,terres,,,1643,0.353883,44.651297
2023-635381,2023-03-07,000001,Vente,14440,,,PRE DE LA REGIE,B077,47800,47003,Agnac,47,,,470030000A1143,,,,,,,,,,,,,0,,,,,T,terres,,,7242,0.354997,44.650909
2023-635381,2023-03-07,000001,Vente,14440,,,PRE DE LA REGIE,B077,47800,47003,Agnac,47,,,470030000A1145,,,,,,,,,,,,,0,,,,,T,terres,,,2008,0.355328,44.650566
2023-635381,2023-03-07,000001,Vente,14440,,,PLAINE DE ROBAN,B073,47800,47003,Agnac,47,,,470030000A1147,,,,,,,,,,,,,0,,,,,T,terres,,,2620,0.35547,44.650142
2023-635381,2023-03-07,000001,Vente,14440,,,PLAINE DE ROBAN,B073,47800,47003,Agnac,47,,,470030000A1148,,,,,,,,,,,,,0,,,,,T,terres,,,119,0.355832,44.650004
2023-636021,2023-03-15,000001,Vente,4000,,,BOIS DE MIAM,B013,47800,47003,Agnac,47,,,470030000C0335,,,,,,,,,,,,,0,,,,,BT,taillis simples,,,4050,0.397468,44.638668
2023-636021,2023-03-15,000001,Vente,4000,,,BOIS DE MIAM,B013,47800,47003,Agnac,47,,,470030000C0339,,,,,,,,,,,,,0,,,,,BT,taillis simples,,,2870,0.397101,44.637789
2023-636030,2023-03-22,000001,Vente,1818,,,AU CELERIEU,B025,47800,47003,Agnac,47,,,470030000D0668,,,,,,,,,,,,,0,,,,,T,terres,,,3030,0.386452,44.632025
2023-636465,2023-04-14,000001,Vente,950000,375,,RTE DU BOUT DU PONT,0038,47800,47003,Agnac,47,,,470030000A1200,,,,,,,,,,,,,0,4,Local industriel. commercial ou assimilé,110,0,S,sols,,,8413,0.342954,44.644559
2023-636465,2023-04-14,000001,Vente,950000,375,,RTE DU BOUT DU PONT,0038,47800,47003,Agnac,47,,,470030000A1200,,,,,,,,,,,,,0,3,Dépendance,,0,P,prés,,,8412,0.342954,44.644559
2023-636465,2023-04-14,000001,Vente,950000,375,,RTE DU BOUT DU PONT,0038,47800,47003,Agnac,47,,,470030000A1200,,,,,,,,,,,,,0,3,Dépendance,,0,P,prés,,,8412,0.342954,44.644559
2023-636465,2023-04-14,000001,Vente,950000,375,,RTE DU BOUT DU PONT,0038,47800,47003,Agnac,47,,,470030000A1200,,,,,,,,,,,,,0,4,Local industriel. commercial ou assimilé,110,0,P,prés,,,8412,0.342954,44.644559
2023-636465,2023-04-14,000001,Vente,950000,375,,RTE DU BOUT DU PONT,0038,47800,47003,Agnac,47,,,470030000A1200,,,,,,,,,,,,,0,1,Maison,474,10,P,prés,,,8412,0.342954,44.644559
2023-636465,2023-04-14,000001,Vente,950000,375,,RTE DU BOUT DU PONT,0038,47800,47003,Agnac,47,,,470030000A1200,,,,,,,,,,,,,0,3,Dépendance,,0,S,sols,,,8413,0.342954,44.644559
2023-636465,2023-04-14,000001,Vente,950000,375,,RTE DU BOUT DU PONT,0038,47800,47003,Agnac,47,,,470030000A1200,,,,,,,,,,,,,0,3,Dépendance,,0,S,sols,,,8413,0.342954,44.644559
2023-636465,2023-04-14,000001,Vente,950000,375,,RTE DU BOUT DU PONT,0038,47800,47003,Agnac,47,,,470030000A1200,,,,,,,,,,,,,0,1,Maison,474,10,S,sols,,,8413,0.342954,44.644559
2023-636841,2023-04-21,000001,Vente,155000,2014,,RTE DE MIRAMONT,0036,47800,47003,Agnac,47,,,470030000A0632,,,,,,,,,,,,,0,1,Maison,55,3,P,prés,,,4114,0.349715,44.645985
2023-636841,2023-04-21,000001,Vente,155000,2014,,RTE DE MIRAMONT,0036,47800,47003,Agnac,47,,,470030000A0632,,,,,,,,,,,,,0,3,Dépendance,,0,P,prés,,,4114,0.349715,44.645985
2023-636841,2023-04-21,000001,Vente,155000,2014,,RTE DE MIRAMONT,0036,47800,47003,Agnac,47,,,470030000A0632,,,,,,,,,,,,,0,1,Maison,55,3,S,sols,,,446,0.349715,44.645985
2023-636841,2023-04-21,000001,Vente,155000,2014,,RTE DE MIRAMONT,0036,47800,47003,Agnac,47,,,470030000A0632,,,,,,,,,,,,,0,3,Dépendance,,0,S,sols,,,446,0.349715,44.645985
2023-637018,2023-05-05,000001,Vente,30000,100,,IMP DU CHEYROU,0030,47800,47003,Agnac,47,,,470030000A1017,,,,,,,,,,,,,0,,,,,S,sols,,,456,0.369247,44.643221
2023-637018,2023-05-05,000001,Vente,30000,,,CHEYROU,B028,47800,47003,Agnac,47,,,470030000A1354,,,,,,,,,,,,,0,,,,,T,terres,,,1252,0.369497,44.64339
2023-637018,2023-05-05,000001,Vente,30000,,,CHEYROU,B028,47800,47003,Agnac,47,,,470030000A1360,,,,,,,,,,,,,0,,,,,T,terres,,,822,0.369805,44.643155
2023-637018,2023-05-05,000001,Vente,30000,,,CHEYROU,B028,47800,47003,Agnac,47,,,470030000A1366,,,,,,,,,,,,,0,,,,,T,terres,,,1234,0.369314,44.643106
2023-637018,2023-05-05,000001,Vente,30000,,,CHEYROU,B028,47800,47003,Agnac,47,,,470030000A1412,,,,,,,,,,,,,0,,,,,T,terres,,,1324,0.370189,44.643207
2023-637226,2023-05-23,000001,Vente,25000,574,,RTE DE L'EGLISE,0019,47800,47003,Agnac,47,,,470030000A1319,,,,,,,,,,,,,0,,,,,T,terres,,,1134,0.370345,44.655574
2023-637226,2023-05-23,000001,Vente,25000,,,LE BOURG,B019,47800,47003,Agnac,47,,,470030000A1324,,,,,,,,,,,,,0,,,,,T,terres,,,217,0.370754,44.655692
2023-637226,2023-05-23,000001,Vente,25000,,,LE BOURG,B019,47800,47003,Agnac,47,,,470030000A1330,,,,,,,,,,,,,0,,,,,BT,taillis simples,,,15,0.370816,44.655657
2023-637966,2023-06-23,000001,Vente,300,,,AU BAYLE,B004,47800,47003,Agnac,47,,,470030000B0157,,,,,,,,,,,,,0,,,,,P,prés,,,5060,0.377613,44.648671
2023-639062,2023-08-23,000001,Vente,68000,,,IFFOUR,B042,47800,47003,Agnac,47,,,470030000D0178,,,,,,,,,,,,,0,,,,,P,prés,,,250,0.38423,44.626344
2023-639062,2023-08-23,000001,Vente,68000,,,IFFOUR,B042,47800,47003,Agnac,47,,,470030000D0179,,,,,,,,,,,,,0,,,,,P,prés,,,7260,0.384345,44.626114
2023-639062,2023-08-23,000001,Vente,68000,,,IFFOUR,B042,47800,47003,Agnac,47,,,470030000D0183,,,,,,,,,,,,,0,,,,,P,prés,,,6440,0.385227,44.625582
2023-639062,2023-08-23,000001,Vente,68000,,,IFFOUR,B042,47800,47003,Agnac,47,,,470030000D0184,,,,,,,,,,,,,0,,,,,P,prés,,,2000,0.384992,44.625686
2023-639062,2023-08-23,000001,Vente,68000,,,IFFOUR,B042,47800,47003,Agnac,47,,,470030000D0207,,,,,,,,,,,,,0,,,,,T,terres,,,1895,0.387316,44.626806
2023-639062,2023-08-23,000001,Vente,68000,,,IFFOUR,B042,47800,47003,Agnac,47,,,470030000D0207,,,,,,,,,,,,,0,,,,,T,terres,,,9445,0.387316,44.626806
2023-639062,2023-08-23,000001,Vente,68000,,,IFFOUR,B042,47800,47003,Agnac,47,,,470030000D0211,,,,,,,,,,,,,0,,,,,P,prés,,,1559,0.38864,44.626559
2023-639062,2023-08-23,000001,Vente,68000,,,IFFOUR,B042,47800,47003,Agnac,47,,,470030000D0211,,,,,,,,,,,,,0,,,,,T,terres,,,1941,0.38864,44.626559
2023-639062,2023-08-23,000001,Vente,68000,,,IFFOUR,B042,47800,47003,Agnac,47,,,470030000D0212,,,,,,,,,,,,,0,,,,,T,terres,,,2990,0.388484,44.626052
2023-639062,2023-08-23,000001,Vente,68000,,,IFFOUR,B042,47800,47003,Agnac,47,,,470030000D0213,,,,,,,,,,,,,0,,,,,T,terres,,,8960,0.387055,44.625804
2023-639062,2023-08-23,000001,Vente,68000,,,IFFOUR,B042,47800,47003,Agnac,47,,,470030000D0214,,,,,,,,,,,,,0,,,,,P,prés,,,1580,0.386556,44.625452
2023-639062,2023-08-23,000001,Vente,68000,,,IFFOUR,B042,47800,47003,Agnac,47,,,470030000D0219,,,,,,,,,,,,,0,,,,,T,terres,,,5000,0.38746,44.624566
2023-639062,2023-08-23,000001,Vente,68000,,,IFFOUR,B042,47800,47003,Agnac,47,,,470030000D0220,,,,,,,,,,,,,0,,,,,BT,taillis simples,,,970,0.387759,44.624096
2023-639062,2023-08-23,000001,Vente,68000,,,IFFOUR,B042,47800,47003,Agnac,47,,,470030000D0222,,,,,,,,,,,,,0,,,,,T,terres,,,16935,0.389108,44.624068
2023-639062,2023-08-23,000001,Vente,68000,,,IFFOUR,B042,47800,47003,Agnac,47,,,470030000D0222,,,,,,,,,,,,,0,,,,,T,terres,,,1545,0.389108,44.624068
2023-639062,2023-08-23,000001,Vente,68000,,,IFFOUR,B042,47800,47003,Agnac,47,,,470030000D0223,,,,,,,,,,,,,0,,,,,P,prés,,,3160,0.387967,44.624953
2023-639062,2023-08-23,000001,Vente,68000,,,IFFOUR,B042,47800,47003,Agnac,47,,,470030000D0224,,,,,,,,,,,,,0,,,,,P,prés,,,1210,0.387297,44.625248
2023-639062,2023-08-23,000001,Vente,68000,,,VIGNES DE LA ROCHELLE,B090,47800,47003,Agnac,47,,,470030000D0295,,,,,,,,,,,,,0,,,,,T,terres,,,13120,0.390998,44.623633
2023-639062,2023-08-23,000001,Vente,68000,,,BOUDIGAY,B017,47800,47003,Agnac,47,,,470030000D0391,,,,,,,,,,,,,0,,,,,L,landes,,,4800,0.389093,44.623113
2023-639062,2023-08-23,000001,Vente,68000,,,BOUDIGAY,B017,47800,47003,Agnac,47,,,470030000D0392,,,,,,,,,,,,,0,,,,,T,terres,,,2430,0.389467,44.623511
2023-639062,2023-08-23,000001,Vente,68000,,,BOUDIGAY,B017,47800,47003,Agnac,47,,,470030000D0393,,,,,,,,,,,,,0,,,,,L,landes,,,1910,0.38877,44.623737
2023-639062,2023-08-23,000001,Vente,68000,,,BOUDIGAY,B017,47800,47003,Agnac,47,,,470030000D0394,,,,,,,,,,,,,0,,,,,AG,terrains d'agrément,,,1900,0.388454,44.623395
2023-639062,2023-08-23,000001,Vente,68000,,,BOUDIGAY,B017,47800,47003,Agnac,47,,,470030000D0401,,,,,,,,,,,,,0,,,,,T,terres,,,1127,0.387781,44.62391
2023-639062,2023-08-23,000001,Vente,68000,,,BOUDIGAY,B017,47800,47003,Agnac,47,,,470030000D0402,,,,,,,,,,,,,0,,,,,L,landes,,,1650,0.387351,44.623692
2023-639062,2023-08-23,000001,Vente,68000,,,BOUDIGAY,B017,47800,47003,Agnac,47,,,470030000D0405,,,,,,,,,,,,,0,,,,,T,terres,,,3810,0.386968,44.623238
2023-639062,2023-08-23,000001,Vente,68000,,,IFFOUR,B042,47800,47003,Agnac,47,,,470030000D0585,,,,,,,,,,,,,0,,,,,T,terres,,,14110,0.388563,44.625552
2023-639062,2023-08-23,000001,Vente,68000,,,IFFOUR,B042,47800,47003,Agnac,47,,,470030000D0586,,,,,,,,,,,,,0,,,,,T,terres,,,6093,0.390002,44.624679
2023-639208,2023-08-04,000003,Vente,110000,,,PRAIRIE D AGNAC,B076,47800,47003,Agnac,47,,,470030000A0009,,,,,,,,,,,,,0,,,,,T,terres,,,11200,0.36246,44.660379
2023-639208,2023-08-04,000003,Vente,110000,,,PRAIRIE D AGNAC,B076,47800,47003,Agnac,47,,,470030000A0010,,,,,,,,,,,,,0,,,,,T,terres,,,11400,0.36329,44.660126
2023-639208,2023-08-04,000003,Vente,110000,,,CAILLOU,B021,47800,47003,Agnac,47,,,470030000A0119,,,,,,,,,,,,,0,,,,,BT,taillis simples,,,999,0.372649,44.648815
2023-639208,2023-08-04,000003,Vente,110000,52,,RTE DE LA PLAINE,0018,47800,47003,Agnac,47,,,470030000A0120,,,,,,,,,,,,,0,,,,,T,terres,,,1617,0.372525,44.649288
2023-639208,2023-08-04,000003,Vente,110000,,,CAILLOU,B021,47800,47003,Agnac,47,,,470030000A0121,,,,,,,,,,,,,0,,,,,T,terres,,,10360,0.371741,44.649616
2023-639208,2023-08-04,000003,Vente,110000,,,CAZEAU,B024,47800,47003,Agnac,47,,,470030000A0123,,,,,,,,,,,,,0,,,,,T,terres,,,11310,0.370538,44.649664
2023-639208,2023-08-04,000003,Vente,110000,,,CAZEAU,B024,47800,47003,Agnac,47,,,470030000A0123,,,,,,,,,,,,,0,,,,,T,terres,,,11310,0.370538,44.649664
2023-639208,2023-08-04,000003,Vente,110000,,,CAZEAU,B024,47800,47003,Agnac,47,,,470030000A0124,,,,,,,,,,,,,0,,,,,T,terres,,,8450,0.368849,44.651745
2023-639208,2023-08-04,000003,Vente,110000,,,BOUDY,B018,47800,47003,Agnac,47,,,470030000A0148,,,,,,,,,,,,,0,,,,,BT,taillis simples,,,40050,0.372679,44.647608
2023-639208,2023-08-04,000003,Vente,110000,,,BOUDY,B018,47800,47003,Agnac,47,,,470030000A0151,,,,,,,,,,,,,0,,,,,BT,taillis simples,,,3520,0.372956,44.645373
2023-639208,2023-08-04,000003,Vente,110000,,,LABARTHE,B047,47800,47003,Agnac,47,,,470030000A0279,,,,,,,,,,,,,0,,,,,T,terres,,,4820,0.363035,44.6496
2023-639208,2023-08-04,000003,Vente,110000,,,LABARTHE,B047,47800,47003,Agnac,47,,,470030000A0280,,,,,,,,,,,,,0,,,,,T,terres,,,21360,0.364538,44.650362
2023-639208,2023-08-04,000003,Vente,110000,,,LABARTHE,B047,47800,47003,Agnac,47,,,470030000A0281,,,,,,,,,,,,,0,,,,,T,terres,,,31970,0.365177,44.648804
2023-639208,2023-08-04,000003,Vente,110000,,,LABARTHE,B047,47800,47003,Agnac,47,,,470030000A0290,,,,,,,,,,,,,0,,,,,T,terres,,,27250,0.362007,44.652674
2023-639208,2023-08-04,000003,Vente,110000,,,LANAUZE,B055,47800,47003,Agnac,47,,,470030000A0291,,,,,,,,,,,,,0,,,,,T,terres,,,1760,0.360885,44.652531
2023-639208,2023-08-04,000003,Vente,110000,,,LANAUZE,B055,47800,47003,Agnac,47,,,470030000A0293,,,,,,,,,,,,,0,,,,,T,terres,,,4796,0.360162,44.652518
2023-639208,2023-08-04,000003,Vente,110000,,,LABRANDE,B050,47800,47003,Agnac,47,,,470030000A0314,,,,,,,,,,,,,0,,,,,BT,taillis simples,,,13386,0.361136,44.654614
2023-639208,2023-08-04,000003,Vente,110000,,,LABARTHE,B047,47800,47003,Agnac,47,,,470030000A0646,,,,,,,,,,,,,0,,,,,P,prés,,,3576,0.363749,44.650458
2023-639208,2023-08-04,000003,Vente,110000,,,CAZEAU,B024,47800,47003,Agnac,47,,,470030000A0649,,,,,,,,,,,,,0,,,,,T,terres,,,1751,0.369445,44.651306
2023-639208,2023-08-04,000003,Vente,110000,,,LABARTHE,B047,47800,47003,Agnac,47,,,470030000A0838,,,,,,,,,,,,,0,,,,,T,terres,,,8367,0.36153,44.650648
2023-639208,2023-08-04,000003,Vente,110000,,,CAZEAU,B024,47800,47003,Agnac,47,,,470030000A0900,,,,,,,,,,,,,0,,,,,T,terres,,,450,0.369087,44.651169
2023-639208,2023-08-04,000003,Vente,110000,,,LANAUZE,B055,47800,47003,Agnac,47,,,470030000A1004,,,,,,,,,,,,,0,,,,,T,terres,,,110,0.358866,44.651452
2023-639208,2023-08-04,000003,Vente,110000,,,LANAUZE,B055,47800,47003,Agnac,47,,,470030000A1007,,,,,,,,,,,,,0,,,,,P,prés,,,12310,0.359127,44.650915
2023-639208,2023-08-04,000003,Vente,110000,,,LANAUZE,B055,47800,47003,Agnac,47,,,470030000A1007,,,,,,,,,,,,,0,,,,,P,prés,,,3625,0.359127,44.650915
2023-639208,2023-08-04,000003,Vente,110000,,,LANAUZE,B055,47800,47003,Agnac,47,,,470030000A1007,,,,,,,,,,,,,0,,,,,E,eaux,,,1875,0.359127,44.650915
2023-639208,2023-08-04,000003,Vente,110000,,,LABARTHE,B047,47800,47003,Agnac,47,,,470030000A1056,,,,,,,,,,,,,0,,,,,T,terres,,,14139,0.364079,44.65304
2023-639208,2023-08-04,000003,Vente,110000,,,LABARTHE,B047,47800,47003,Agnac,47,,,470030000A1447,,,,,,,,,,,,,0,,,,,P,prés,,,10401,0.364213,44.651611
2023-639208,2023-08-04,000003,Vente,110000,743,,RTE DE MIRAMONT,0036,47800,47003,Agnac,47,,,470030000A1449,,,,,,,,,,,,,0,,,,,S,sols,,,199,0.363327,44.652074
2023-639538,2023-01-19,000001,Adjudication,83000,,,RTE DU BOUT DU PONT,0038,47800,47003,Agnac,47,,,470030000A0670,,,,,,,,,,,,,0,4,Local industriel. commercial ou assimilé,1571,0,S,sols,,,2535,0.346266,44.643571
2023-639538,2023-01-19,000001,Adjudication,83000,101,,RTE DU BOUT DU PONT,0038,47800,47003,Agnac,47,,,470030000A0792,,,,,,,,,,,,,0,,,,,S,sols,,,3975,0.346453,44.64372
2023-639538,2023-01-19,000001,Adjudication,83000,,,AU BOUT DU PONT,B020,47800,47003,Agnac,47,,,470030000A0793,,,,,,,,,,,,,0,,,,,P,prés,,,275,0.346726,44.643445
2023-639538,2023-01-19,000001,Adjudication,83000,,,AU BOUT DU PONT,B020,47800,47003,Agnac,47,,,470030000A1275,,,,,,,,,,,,,0,,,,,T,terres,,,2450,0.346526,44.643291
2023-639538,2023-01-19,000001,Adjudication,83000,,,AU BOUT DU PONT,B020,47800,47003,Agnac,47,,,470030000A1275,,,,,,,,,,,,,0,,,,,T,terres,,,2450,0.346526,44.643291
2023-639766,2023-09-22,000001,Vente,138000,,,LABARTHE,B047,47800,47003,Agnac,47,,,470030000A1446,,,,,,,,,,,,,0,,,,,P,prés,,,371,0.363641,44.651722
2023-639766,2023-09-22,000001,Vente,138000,743,,RTE DE MIRAMONT,0036,47800,47003,Agnac,47,,,470030000A1448,,,,,,,,,,,,,0,4,Local industriel. commercial ou assimilé,40,0,S,sols,,,3443,0.363155,44.651763
2023-639766,2023-09-22,000001,Vente,138000,743,,RTE DE MIRAMONT,0036,47800,47003,Agnac,47,,,470030000A1448,,,,,,,,,,,,,0,1,Maison,105,4,S,sols,,,3443,0.363155,44.651763
2023-639766,2023-09-22,000001,Vente,138000,,,LABARTHE,B047,47800,47003,Agnac,47,,,470030000A1450,,,,,,,,,,,,,0,,,,,P,prés,,,4769,0.363581,44.651242
2023-639766,2023-09-22,000001,Vente,138000,,,LABARTHE,B047,47800,47003,Agnac,47,,,470030000A1450,,,,,,,,,,,,,0,,,,,S,sols,,,1600,0.363581,44.651242
2023-639766,2023-09-22,000001,Vente,138000,,,LABARTHE,B047,47800,47003,Agnac,47,,,470030000A1452,,,,,,,,,,,,,0,,,,,P,prés,,,937,0.362673,44.651826
2023-639925,2023-10-05,000001,Vente,287500,,,LESCOUSSOU,B058,47800,47003,Agnac,47,,,470030000B0012,,,,,,,,,,,,,0,,,,,T,terres,,,2901,0.384212,44.653113
2023-639925,2023-10-05,000001,Vente,287500,971,,RTE D'EYMET,0037,47800,47003,Agnac,47,,,470030000B0663,,,,,,,,,,,,,0,1,Maison,246,7,AG,terrains d'agrément,,,1709,0.384304,44.65339
2023-639925,2023-10-05,000001,Vente,287500,971,,RTE D'EYMET,0037,47800,47003,Agnac,47,,,470030000B0663,,,,,,,,,,,,,0,1,Maison,246,7,VE,vergers,,,1401,0.384304,44.65339
2023-639925,2023-10-05,000001,Vente,287500,971,,RTE D'EYMET,0037,47800,47003,Agnac,47,,,470030000B0663,,,,,,,,,,,,,0,1,Maison,246,7,S,sols,,,684,0.384304,44.65339
2023-639925,2023-10-05,000001,Vente,287500,,,LESCOUSSOU,B058,47800,47003,Agnac,47,,,470030000B0666,,,,,,,,,,,,,0,,,,,T,terres,,,311,0.383599,44.653409
2023-640076,2023-09-18,000001,Vente,100000,,,BELANGER,B006,47800,47003,Agnac,47,,,470030000C0542,,,,,,,,,,,,,0,,,,,S,sols,,,96,0.392356,44.640156
2023-640076,2023-09-18,000001,Vente,100000,,,BELANGER,B006,47800,47003,Agnac,47,,,470030000C0543,,,,,,,,,,,,,0,,,,,S,sols,,,587,0.3925,44.640067
2023-640076,2023-09-18,000001,Vente,100000,,,BELANGER,B006,47800,47003,Agnac,47,,,470030000C0544,,,,,,,,,,,,,0,,,,,S,sols,,,30,0.392685,44.639761
2023-640076,2023-09-18,000001,Vente,100000,544,,RTE DE BOURGOUGNAGUE,0015,47800,47003,Agnac,47,,,470030000C0546,,,,,,,,,,,,,0,1,Maison,80,3,S,sols,,,932,0.392624,44.639979
2023-640076,2023-09-18,000001,Vente,100000,544,,RTE DE BOURGOUGNAGUE,0015,47800,47003,Agnac,47,,,470030000C0546,,,,,,,,,,,,,0,4,Local industriel. commercial ou assimilé,150,0,S,sols,,,932,0.392624,44.639979
2023-640076,2023-09-18,000001,Vente,100000,,,BELANGER,B006,47800,47003,Agnac,47,,,470030000C0548,,,,,,,,,,,,,0,,,,,S,sols,,,207,0.392827,44.639889
2023-640315,2023-09-18,000001,Vente,440000,,,TROMPE,B086,47800,47003,Agnac,47,,,470030000A0815,,,,,,,,,,,,,0,,,,,P,prés,,,72,0.349086,44.638014
2023-640315,2023-09-18,000001,Vente,440000,,,TROMPE,B086,47800,47003,Agnac,47,,,470030000A0818,,,,,,,,,,,,,0,,,,,P,prés,,,135,0.349162,44.637985
2023-640315,2023-09-18,000001,Vente,440000,,,TROMPE,B086,47800,47003,Agnac,47,,,470030000A0825,,,,,,,,,,,,,0,,,,,P,prés,,,2234,0.348634,44.638281
2023-640373,2023-10-18,000001,Vente,253002,,,TROMPE,B086,47800,47003,Agnac,47,,,470030000A0555,,,,,,,,,,,,,0,,,,,P,prés,,,5226,0.351118,44.638132
2023-640373,2023-10-18,000001,Vente,253002,,,TROMPE,B086,47800,47003,Agnac,47,,,470030000A0555,,,,,,,,,,,,,0,,,,,BP,peupleraies,,,1094,0.351118,44.638132
2023-640373,2023-10-18,000001,Vente,253002,,,TROMPE,B086,47800,47003,Agnac,47,,,470030000A0556,,,,,,,,,,,,,0,,,,,BT,taillis simples,,,2289,0.351138,44.63867
2023-640373,2023-10-18,000001,Vente,253002,,,TROMPE,B086,47800,47003,Agnac,47,,,470030000A0557,,,,,,,,,,,,,0,,,,,S,sols,,,845,0.349975,44.638415
2023-640373,2023-10-18,000001,Vente,253002,,,TROMPE,B086,47800,47003,Agnac,47,,,470030000A0557,,,,,,,,,,,,,0,,,,,P,prés,,,3390,0.349975,44.638415
2023-640373,2023-10-18,000001,Vente,253002,2873,,RTE DE MIRAMONT,0036,47800,47003,Agnac,47,,,470030000A0558,,,,,,,,,,,,,0,1,Maison,105,5,S,sols,,,1510,0.349529,44.638708
2023-640373,2023-10-18,000001,Vente,253002,,,TROMPE,B086,47800,47003,Agnac,47,,,470030000A0991,,,,,,,,,,,,,0,,,,,P,prés,,,7514,0.350399,44.639705
2023-640373,2023-10-18,000001,Vente,253002,,,TROMPE,B086,47800,47003,Agnac,47,,,470030000A0991,,,,,,,,,,,,,0,,,,,L,landes,,,600,0.350399,44.639705
2023-640373,2023-10-18,000001,Vente,253002,,,TROMPE,B086,47800,47003,Agnac,47,,,470030000A1191,,,,,,,,,,,,,0,,,,,P,prés,,,218,0.348492,44.639158
2023-640373,2023-10-18,000001,Vente,253002,,,TROMPE,B086,47800,47003,Agnac,47,,,470030000A1192,,,,,,,,,,,,,0,,,,,P,prés,,,2227,0.349293,44.638555
2023-640373,2023-10-18,000001,Vente,253002,,,TROMPE,B086,47800,47003,Agnac,47,,,470030000A1192,,,,,,,,,,,,,0,,,,,S,sols,,,750,0.349293,44.638555
2023-640373,2023-10-18,000001,Vente,253002,1,,TROMPE,B086,47800,47003,Agnac,47,,,470030000A1193,,,,,,,,,,,,,0,1,Maison,73,3,P,prés,,,2625,0.349848,44.639234
2023-640373,2023-10-18,000001,Vente,253002,1,,TROMPE,B086,47800,47003,Agnac,47,,,470030000A1193,,,,,,,,,,,,,0,3,Dépendance,,0,P,prés,,,17598,0.349848,44.639234