id_mutation,date_mutation,numero_disposition,nature_mutation,valeur_fonciere,adresse_numero,adresse_suffixe,adresse_nom_voie,adresse_code_voie,code_postal,code_commune,nom_commune,code_departement,ancien_code_commune,ancien_nom_commune,id_parcelle,ancien_id_parcelle,numero_volume,lot1_numero,lot1_surface_carrez,lot2_numero,lot2_surface_carrez,lot3_numero,lot3_surface_carrez,lot4_numero,lot4_surface_carrez,lot5_numero,lot5_surface_carrez,nombre_lots,code_type_local,type_local,surface_reelle_bati,nombre_pieces_principales,code_nature_culture,nature_culture,code_nature_culture_speciale,nature_culture_speciale,surface_terrain,longitude,latitude
2023-634257,2023-01-06,000002,Vente,75000,,,AUX CARDINALS,B024,47270,47269,Saint-Pierre-de-Clairac,47,,,472690000E0915,,,,,,,,,,,,,0,,,,,T,terres,,,722,0.756817,44.170769
2023-634257,2023-01-06,000002,Vente,75000,,,AUX CARDINALS,B024,47270,47269,Saint-Pierre-de-Clairac,47,,,472690000E0917,,,,,,,,,,,,,0,,,,,P,prés,,,3391,0.75684,44.170608
2023-634257,2023-01-06,000002,Vente,75000,,,AUX CARDINALS,B024,47270,47269,Saint-Pierre-de-Clairac,47,,,472690000E1104,,,,,,,,,,,,,0,,,,,S,sols,,,523,0.757121,44.170195
2023-634623,2023-01-31,000001,Vente,162000,,,JAMET,B046,47270,47269,Saint-Pierre-de-Clairac,47,,,472690000E0167,,,,,,,,,,,,,0,,,,,T,terres,,,10900,0.741188,44.172857
2023-634623,2023-01-31,000001,Vente,162000,,,JAMET,B046,47270,47269,Saint-Pierre-de-Clairac,47,,,472690000E0171,,,,,,,,,,,,,0,,,,,T,terres,,,940,0.741645,44.172653
2023-634623,2023-01-31,000001,Vente,162000,115,,JAMET,B046,47270,47269,Saint-Pierre-de-Clairac,47,,,472690000E0999,,,,,,,,,,,,,0,3,Dépendance,,0,S,sols,,,558,0.741897,44.172605
2023-634623,2023-01-31,000001,Vente,162000,115,,JAMET,B046,47270,47269,Saint-Pierre-de-Clairac,47,,,472690000E0999,,,,,,,,,,,,,0,1,Maison,100,4,S,sols,,,558,0.741897,44.172605
2023-634623,2023-01-31,000001,Vente,162000,,,JAMET,B046,47270,47269,Saint-Pierre-de-Clairac,47,,,472690000E1000,,,,,,,,,,,,,0,,,,,S,sols,,,11,0.741315,44.17274
2023-634623,2023-01-31,000001,Vente,162000,,,JAMET,B046,47270,47269,Saint-Pierre-de-Clairac,47,,,472690000E1001,,,,,,,,,,,,,0,,,,,S,sols,,,11,0.741524,44.172514
2023-634722,2023-02-01,000002,Vente,20000,,,CHAPEYROUX,B027,47270,47269,Saint-Pierre-de-Clairac,47,,,472690000E1106,,,,,,,,,,,,,0,,,,,S,sols,,,543,0.745487,44.17276
2023-634722,2023-02-01,000002,Vente,20000,,,CHAPEYROUX,B027,47270,47269,Saint-Pierre-de-Clairac,47,,,472690000E1108,,,,,,,,,,,,,0,,,,,P,prés,,,565,0.74539,44.17279
2023-634722,2023-02-01,000002,Vente,20000,,,JAMET,B046,47270,47269,Saint-Pierre-de-Clairac,47,,,472690000E1110,,,,,,,,,,,,,0,,,,,P,prés,,,637,0.745179,44.172834
2023-634795,2023-02-21,000001,Vente,162000,5311,,BOULET,B017,47270,47269,Saint-Pierre-de-Clairac,47,,,472690000B0188,,,,,,,,,,,,,0,1,Maison,105,3,T,terres,,,2013,0.761196,44.189613
2023-634795,2023-02-21,000001,Vente,162000,5311,,BOULET,B017,47270,47269,Saint-Pierre-de-Clairac,47,,,472690000B0188,,,,,,,,,,,,,0,1,Maison,105,3,S,sols,,,967,0.761196,44.189613
2023-636197,2023-04-13,000001,Vente,230000,,,POUGET,B095,47270,47269,Saint-Pierre-de-Clairac,47,,,472690000E1101,,,,,,,,,,,,,0,,,,,S,sols,,,1136,0.759823,44.169608
2023-636197,2023-04-13,000001,Vente,230000,,,POUGET,B095,47270,47269,Saint-Pierre-de-Clairac,47,,,472690000E1102,,,,,,,,,,,,,0,,,,,S,sols,,,241,0.759743,44.169772
2023-636552,2023-04-28,000001,Vente,374604,,,PASSERE,B080,47270,47269,Saint-Pierre-de-Clairac,47,,,472690000D0577,,,,,,,,,,,,,0,1,Maison,143,5,S,sols,,,1000,0.764267,44.175847
2023-636552,2023-04-28,000001,Vente,374604,,,PASSERE,B080,47270,47269,Saint-Pierre-de-Clairac,47,,,472690000D0579,,,,,,,,,,,,,0,,,,,AG,terrains d'agrément,,,1500,0.764366,44.175502
2023-636599,2023-05-03,000002,Echange,3000,,,LES CLOUTASSES,B028,47270,47269,Saint-Pierre-de-Clairac,47,,,472690000C0148,,,,,,,,,,,,,0,,,,,VI,vignes,,,1640,0.763697,44.182089
2023-636599,2023-05-03,000003,Echange,3000,,,A LA MARIANNE,B061,47270,47269,Saint-Pierre-de-Clairac,47,,,472690000C0948,,,,,,,,,,,,,0,,,,,T,terres,,,239,0.763427,44.182583
2023-636599,2023-05-03,000003,Echange,3000,,,A LA MARIANNE,B061,47270,47269,Saint-Pierre-de-Clairac,47,,,472690000C0950,,,,,,,,,,,,,0,,,,,T,terres,,,1379,0.762997,44.182257
2023-636608,2023-05-05,000001,Vente,290000,5165,,LAJOLIE,B053,47270,47269,Saint-Pierre-de-Clairac,47,,,472690000D0037,,,,,,,,,,,,,0,3,Dépendance,,0,J,jardins,POTAG,Jardin potager,1560,0.769163,44.176096
2023-636608,2023-05-05,000001,Vente,290000,5165,,LAJOLIE,B053,47270,47269,Saint-Pierre-de-Clairac,47,,,472690000D0037,,,,,,,,,,,,,0,1,Maison,118,3,S,sols,,,970,0.769163,44.176096
2023-636608,2023-05-05,000001,Vente,290000,5165,,LAJOLIE,B053,47270,47269,Saint-Pierre-de-Clairac,47,,,472690000D0037,,,,,,,,,,,,,0,3,Dépendance,,0,S,sols,,,970,0.769163,44.176096
2023-636608,2023-05-05,000001,Vente,290000,5165,,LAJOLIE,B053,47270,47269,Saint-Pierre-de-Clairac,47,,,472690000D0037,,,,,,,,,,,,,0,1,Maison,118,3,J,jardins,POTAG,Jardin potager,1560,0.769163,44.176096
2023-637532,2023-06-16,000001,Vente,900,,,LACOMBE,B050,47270,47269,Saint-Pierre-de-Clairac,47,,,472690000D0121,,,,,,,,,,,,,0,,,,,BT,taillis simples,,,2900,0.776124,44.165154
2023-637695,2023-06-27,000001,Vente,433700,198,,RTE DE SAINT PIERRE,0259,47270,47269,Saint-Pierre-de-Clairac,47,,,47269000AA0034,,,,,,,,,,,,,0,1,Maison,225,6,S,sols,,,1160,0.761176,44.177956
2023-637695,2023-06-27,000001,Vente,433700,,,AU DUC,B033,47270,47269,Saint-Pierre-de-Clairac,47,,,47269000AA0212,,,,,,,,,,,,,0,,,,,T,terres,,,819,0.761626,44.177834
2023-637695,2023-06-27,000001,Vente,433700,,,AU DUC,B033,47270,47269,Saint-Pierre-de-Clairac,47,,,47269000AA0214,,,,,,,,,,,,,0,,,,,J,jardins,POTAG,Jardin potager,1690,0.761464,44.177664
2023-637695,2023-06-27,000001,Vente,433700,,,AU DUC,B033,47270,47269,Saint-Pierre-de-Clairac,47,,,47269000AA0216,,,,,,,,,,,,,0,,,,,T,terres,,,575,0.761276,44.178169
2023-638744,2023-07-28,000001,Vente,200000,658,,RTE DE SAINT JEAN,0044,47270,47269,Saint-Pierre-de-Clairac,47,,,472690000E0972,,,,,,,,,,,,,0,1,Maison,94,4,T,terres,,,1210,0.758432,44.171991
2023-638744,2023-07-28,000001,Vente,200000,658,,RTE DE SAINT JEAN,0044,47270,47269,Saint-Pierre-de-Clairac,47,,,472690000E0972,,,,,,,,,,,,,0,1,Maison,94,4,S,sols,,,500,0.758432,44.171991
2023-640461,2023-10-26,000001,Echange,4500,,,GALIGNAN,B038,47270,47269,Saint-Pierre-de-Clairac,47,,,472690000F0225,,,,,,,,,,,,,0,,,,,T,terres,,,1190,0.726243,44.167749
2023-640461,2023-10-26,000001,Echange,4500,,,GALIGNAN,B038,47270,47269,Saint-Pierre-de-Clairac,47,,,472690000F0226,,,,,,,,,,,,,0,,,,,T,terres,,,7795,0.726885,44.168109
2023-640461,2023-10-26,000002,Echange,4500,,,LABARTHE,B049,47270,47269,Saint-Pierre-de-Clairac,47,,,472690000F0240,,,,,,,,,,,,,0,,,,,T,terres,,,8865,0.725369,44.170422
2023-640973,2023-11-18,000001,Vente,228000,81,,RTE DE SAINT PIERRE,0259,47270,47269,Saint-Pierre-de-Clairac,47,,,47269000AA0019,,,,,,,,,,,,,0,1,Maison,124,5,S,sols,,,630,0.761335,44.177188
2023-641313,2023-12-08,000001,Vente,180000,,,AU GRIL,B045,47270,47269,Saint-Pierre-de-Clairac,47,,,472690000C0856,,,,,,,,,,,,,0,,,,,T,terres,,,426,0.751209,44.175478
2023-641313,2023-12-08,000001,Vente,180000,124,,AU GRIL,B045,47270,47269,Saint-Pierre-de-Clairac,47,,,472690000C0941,,,,,,,,,,,,,0,1,Maison,190,4,S,sols,,,1034,0.750917,44.175209
2023-641313,2023-12-08,000001,Vente,180000,,,AU GRIL,B045,47270,47269,Saint-Pierre-de-Clairac,47,,,472690000C0942,,,,,,,,,,,,,0,,,,,S,sols,,,755,0.75125,44.175258
2023-641313,2023-12-08,000001,Vente,180000,,,AU GRIL,B045,47270,47269,Saint-Pierre-de-Clairac,47,,,472690000C0943,,,,,,,,,,,,,0,,,,,S,sols,,,20,0.750815,44.175337
2023-641753,2023-12-13,000001,Vente,185000,,,LA REMISE,B103,47270,47269,Saint-Pierre-de-Clairac,47,,,472690000B0340,,,,,,,,,,,,,0,,,,,T,terres,,,500,0.744204,44.184321
2023-641753,2023-12-13,000001,Vente,185000,187,,RTE DE CABALSAUT,0038,47270,47269,Saint-Pierre-de-Clairac,47,,,472690000B0341,,,,,,,,,,,,,0,1,Maison,157,5,S,sols,,,262,0.743636,44.184363
2023-641753,2023-12-13,000001,Vente,185000,187,,RTE DE CABALSAUT,0038,47270,47269,Saint-Pierre-de-Clairac,47,,,472690000B0341,,,,,,,,,,,,,0,1,Maison,157,5,T,terres,,,3313,0.743636,44.184363
2023-641795,2023-12-28,000001,Vente,365650,379,,CHE DU PONT DE LABE,0026,47270,47269,Saint-Pierre-de-Clairac,47,,,472690000E0954,,,,,,,,,,,,,0,1,Maison,180,5,S,sols,,,1000,0.75413,44.171921
2023-641795,2023-12-28,000001,Vente,365650,379,,CHE DU PONT DE LABE,0026,47270,47269,Saint-Pierre-de-Clairac,47,,,472690000E0954,,,,,,,,,,,,,0,1,Maison,180,5,T,terres,,,1962,0.75413,44.171921
