id_mutation,date_mutation,numero_disposition,nature_mutation,valeur_fonciere,adresse_numero,adresse_suffixe,adresse_nom_voie,adresse_code_voie,code_postal,code_commune,nom_commune,code_departement,ancien_code_commune,ancien_nom_commune,id_parcelle,ancien_id_parcelle,numero_volume,lot1_numero,lot1_surface_carrez,lot2_numero,lot2_surface_carrez,lot3_numero,lot3_surface_carrez,lot4_numero,lot4_surface_carrez,lot5_numero,lot5_surface_carrez,nombre_lots,code_type_local,type_local,surface_reelle_bati,nombre_pieces_principales,code_nature_culture,nature_culture,code_nature_culture_speciale,nature_culture_speciale,surface_terrain,longitude,latitude
2023-663247,2023-02-22,000001,Vente,205000,5024,,LE HAUT HAMEL,B160,50390,50105,Catteville,50,,,50105000ZB0032,,,,,,,,,,,,,0,1,Maison,140,7,AG,terrains d'agrément,,,2636,-1.556018,49.34992
2023-663247,2023-02-22,000001,Vente,205000,5024,,LE HAUT HAMEL,B160,50390,50105,Catteville,50,,,50105000ZB0032,,,,,,,,,,,,,0,1,Maison,140,7,S,sols,,,500,-1.556018,49.34992
2023-663247,2023-02-22,000001,Vente,205000,,,LE BAS HAMEL,B006,50390,50105,Catteville,50,,,50105000ZC0026,,,,,,,,,,,,,0,,,,,L,landes,,,86,-1.556718,49.350089
2023-663443,2023-03-04,000001,Vente,130000,5033,A,VILLAGE AU PRINCE,B360,50390,50105,Catteville,50,,,50105000ZC0083,,,,,,,,,,,,,0,1,Maison,82,3,S,sols,,,1611,-1.561627,49.357584
2023-667940,2023-06-30,000001,Vente,200000,,,LA RATERIE,B336,50390,50105,Catteville,50,,,50105000ZA0005,,,,,,,,,,,,,0,,,,,T,terres,,,15540,-1.572857,49.362624
2023-667940,2023-06-30,000001,Vente,200000,,,LA RATERIE,B336,50390,50105,Catteville,50,,,50105000ZA0005,,,,,,,,,,,,,0,,,,,P,prés,,,50792,-1.572857,49.362624
2023-667940,2023-06-30,000001,Vente,200000,,,LA RATERIE,B336,50390,50105,Catteville,50,,,50105000ZA0005,,,,,,,,,,,,,0,,,,,P,prés,,,47442,-1.572857,49.362624
2023-667940,2023-06-30,000001,Vente,200000,,,LA RATERIE,B336,50390,50105,Catteville,50,,,50105000ZA0005,,,,,,,,,,,,,0,,,,,P,prés,,,1685,-1.572857,49.362624
2023-667940,2023-06-30,000001,Vente,200000,5010,,LA RATERIE,B336,50390,50105,Catteville,50,,,50105000ZA0006,,,,,,,,,,,,,0,1,Maison,180,6,S,sols,,,1676,-1.570075,49.364207
2023-667940,2023-06-30,000001,Vente,200000,5010,,LA RATERIE,B336,50390,50105,Catteville,50,,,50105000ZA0006,,,,,,,,,,,,,0,3,Dépendance,,0,S,sols,,,1676,-1.570075,49.364207
2023-667940,2023-06-30,000001,Vente,200000,5010,,LA RATERIE,B336,50390,50105,Catteville,50,,,50105000ZA0006,,,,,,,,,,,,,0,1,Maison,180,6,P,prés,,,14605,-1.570075,49.364207
2023-667940,2023-06-30,000001,Vente,200000,5010,,LA RATERIE,B336,50390,50105,Catteville,50,,,50105000ZA0006,,,,,,,,,,,,,0,3,Dépendance,,0,P,prés,,,14605,-1.570075,49.364207
2023-667940,2023-06-30,000001,Vente,200000,5010,,LA RATERIE,B336,50390,50105,Catteville,50,,,50105000ZA0006,,,,,,,,,,,,,0,1,Maison,180,6,J,jardins,,,812,-1.570075,49.364207
2023-667940,2023-06-30,000001,Vente,200000,5010,,LA RATERIE,B336,50390,50105,Catteville,50,,,50105000ZA0006,,,,,,,,,,,,,0,3,Dépendance,,0,J,jardins,,,812,-1.570075,49.364207
2023-667940,2023-06-30,000001,Vente,200000,,,LA RATERIE,B336,50390,50105,Catteville,50,,,50105000ZA0021,,,,,,,,,,,,,0,,,,,BT,taillis simples,,,420,-1.566959,49.368268
2023-667940,2023-06-30,000001,Vente,200000,,,LA RATERIE,B336,50390,50105,Catteville,50,,,50105000ZA0021,,,,,,,,,,,,,0,,,,,P,prés,,,2534,-1.566959,49.368268
2023-667940,2023-06-30,000001,Vente,200000,,,LA RATERIE,B336,50390,50105,Catteville,50,,,50105000ZA0021,,,,,,,,,,,,,0,,,,,P,prés,,,5112,-1.566959,49.368268
2023-667940,2023-06-30,000001,Vente,200000,,,LA RATERIE,B336,50390,50105,Catteville,50,,,50105000ZA0022,,,,,,,,,,,,,0,,,,,P,prés,,,16488,-1.566416,49.368038
2023-667940,2023-06-30,000001,Vente,200000,,,LA RATERIE,B336,50390,50105,Catteville,50,,,50105000ZA0027,,,,,,,,,,,,,0,,,,,P,prés,,,33572,-1.565108,49.366842
2023-667940,2023-06-30,000001,Vente,200000,,,LA RATERIE,B336,50390,50105,Catteville,50,,,50105000ZA0027,,,,,,,,,,,,,0,,,,,BT,taillis simples,,,3231,-1.565108,49.366842
2023-667940,2023-06-30,000001,Vente,200000,,,LA RATERIE,B336,50390,50105,Catteville,50,,,50105000ZA0032,,,,,,,,,,,,,0,,,,,T,terres,,,7576,-1.567866,49.364654
2023-667940,2023-06-30,000001,Vente,200000,,,LA RATERIE,B336,50390,50105,Catteville,50,,,50105000ZA0036,,,,,,,,,,,,,0,,,,,P,prés,,,11661,-1.56846,49.362629
2023-667940,2023-06-30,000001,Vente,200000,,,VILLAGE AU TELLIER,B361,50390,50105,Catteville,50,,,50105000ZA0066,,,,,,,,,,,,,0,,,,,P,prés,,,3755,-1.568462,49.35661
2023-667940,2023-06-30,000001,Vente,200000,,,VILLAGE AU TELLIER,B361,50390,50105,Catteville,50,,,50105000ZA0074,,,,,,,,,,,,,0,,,,,T,terres,,,8678,-1.570809,49.355634
2023-667940,2023-06-30,000001,Vente,200000,,,LA RATERIE,B336,50390,50105,Catteville,50,,,50105000ZA0115,,,,,,,,,,,,,0,,,,,P,prés,,,3348,-1.564433,49.365896
2023-667940,2023-06-30,000001,Vente,200000,,,LE BAS HAMEL,B006,50390,50105,Catteville,50,,,50105000ZC0040,,,,,,,,,,,,,0,,,,,P,prés,MARAI,Pré marais,6770,-1.563611,49.350549
2023-667940,2023-06-30,000001,Vente,200000,,,LE BAS HAMEL,B006,50390,50105,Catteville,50,,,50105000ZC0046,,,,,,,,,,,,,0,,,,,P,prés,MARAI,Pré marais,18976,-1.564973,49.350258
2023-667996,2023-06-30,000001,Vente,3000,,,LA BLONDERIE,B010,50390,50105,Catteville,50,,,50105000ZC0020,,,,,,,,,,,,,0,,,,,P,prés,,,2003,-1.561751,49.352416
2023-669734,2023-08-01,000001,Vente,115000,5031,,VILLAGE AU PRINCE,B360,50390,50105,Catteville,50,,,50105000ZB0046,,,,,,,,,,,,,0,3,Dépendance,,0,S,sols,,,838,-1.560678,49.356991
2023-669734,2023-08-01,000001,Vente,115000,5031,,VILLAGE AU PRINCE,B360,50390,50105,Catteville,50,,,50105000ZB0046,,,,,,,,,,,,,0,1,Maison,50,2,S,sols,,,838,-1.560678,49.356991
