id_mutation,date_mutation,numero_disposition,nature_mutation,valeur_fonciere,adresse_numero,adresse_suffixe,adresse_nom_voie,adresse_code_voie,code_postal,code_commune,nom_commune,code_departement,ancien_code_commune,ancien_nom_commune,id_parcelle,ancien_id_parcelle,numero_volume,lot1_numero,lot1_surface_carrez,lot2_numero,lot2_surface_carrez,lot3_numero,lot3_surface_carrez,lot4_numero,lot4_surface_carrez,lot5_numero,lot5_surface_carrez,nombre_lots,code_type_local,type_local,surface_reelle_bati,nombre_pieces_principales,code_nature_culture,nature_culture,code_nature_culture_speciale,nature_culture_speciale,surface_terrain,longitude,latitude
2023-665413,2023-04-13,000001,Vente,14400,,,LE MARAIS,B308,50220,50108,Céaux,50,,,50108000ZA0170,,,,,,,,,,,,,0,,,,,P,prés,,,1865,-1.388023,48.640658
2023-665413,2023-04-13,000001,Vente,14400,,,LE MARAIS,B308,50220,50108,Céaux,50,,,50108000ZA0170,,,,,,,,,,,,,0,,,,,T,terres,,,12044,-1.388023,48.640658
2023-665413,2023-04-13,000001,Vente,14400,,,LE MARAIS,B308,50220,50108,Céaux,50,,,50108000ZA0170,,,,,,,,,,,,,0,,,,,P,prés,,,1865,-1.388023,48.640658
2023-666009,2023-04-28,000001,Vente,30000,,,LES FORGES,B198,50220,50108,Céaux,50,,,50108000ZE0004,,,,,,,,,,,,,0,,,,,T,terres,,,20100,-1.398138,48.628344
2023-667129,2023-05-31,000001,Vente,134189,1,,LA GREVE,B247,50220,50108,Céaux,50,,,50108000ZA0101,,,,,,,,,,,,,0,1,Maison,41,3,T,terres,,,3554,-1.385577,48.640766
2023-667129,2023-05-31,000001,Vente,134189,1,,LA GREVE,B247,50220,50108,Céaux,50,,,50108000ZA0101,,,,,,,,,,,,,0,1,Maison,41,3,S,sols,,,536,-1.385577,48.640766
2023-668962,2023-07-25,000001,Vente,1000,,,LE VAL HUBERT,B513,50220,50108,Céaux,50,,,50108000ZB0259,,,,,,,,,,,,,0,,,,,T,terres,,,808,-1.379408,48.627645
2023-669022,2023-07-21,000001,Vente,270000,12,,LA MOTTAISERIE,B322,50220,50108,Céaux,50,,,50108000ZE0151,,,,,,,,,,,,,0,1,Maison,100,4,J,jardins,,,841,-1.389018,48.625238
2023-669022,2023-07-21,000001,Vente,270000,12,,LA MOTTAISERIE,B322,50220,50108,Céaux,50,,,50108000ZE0151,,,,,,,,,,,,,0,1,Maison,100,4,S,sols,,,500,-1.389018,48.625238
2023-672819,2023-11-14,000001,Vente,550000,1,,LA MOTTAISERIE,B322,50220,50108,Céaux,50,,,50108000ZE0016,,,,,,,,,,,,,0,4,Local industriel. commercial ou assimilé,9000,0,S,sols,,,9960,-1.38756,48.626257
2023-672819,2023-11-14,000001,Vente,550000,1,,LA MOTTAISERIE,B322,50220,50108,Céaux,50,,,50108000ZE0016,,,,,,,,,,,,,0,1,Maison,78,4,S,sols,,,9960,-1.38756,48.626257
2023-674707,2023-12-29,000001,Vente,71600,,,FONTENELLE,B193,50220,50108,Céaux,50,,,50108000ZA0003,,,,,,,,,,,,,0,,,,,T,terres,,,35180,-1.397684,48.631249
2023-674707,2023-12-29,000001,Vente,71600,,,LA GRISETIERE,B251,50220,50108,Céaux,50,,,50108000ZA0083,,,,,,,,,,,,,0,,,,,P,prés,,,23730,-1.392249,48.632715
2023-674707,2023-12-29,000001,Vente,71600,,,LA GRISETIERE,B251,50220,50108,Céaux,50,,,50108000ZA0083,,,,,,,,,,,,,0,,,,,T,terres,,,4990,-1.392249,48.632715
2023-674707,2023-12-29,000001,Vente,71600,,,LE GRAND MONDRIN,B218,50220,50108,Céaux,50,,,50108000ZH0015,,,,,,,,,,,,,0,,,,,T,terres,,,11480,-1.405906,48.634263
