id_mutation,date_mutation,numero_disposition,nature_mutation,valeur_fonciere,adresse_numero,adresse_suffixe,adresse_nom_voie,adresse_code_voie,code_postal,code_commune,nom_commune,code_departement,ancien_code_commune,ancien_nom_commune,id_parcelle,ancien_id_parcelle,numero_volume,lot1_numero,lot1_surface_carrez,lot2_numero,lot2_surface_carrez,lot3_numero,lot3_surface_carrez,lot4_numero,lot4_surface_carrez,lot5_numero,lot5_surface_carrez,nombre_lots,code_type_local,type_local,surface_reelle_bati,nombre_pieces_principales,code_nature_culture,nature_culture,code_nature_culture_speciale,nature_culture_speciale,surface_terrain,longitude,latitude
2023-662500,2023-01-10,000001,Vente,66000,5229,,LES CHAMPS,B029,50640,50570,Savigny-le-Vieux,50,,,50570000ZC0087,,,,,,,,,,,,,0,3,Dépendance,,0,VE,vergers,,,6134,-1.041331,48.530245
2023-662500,2023-01-10,000001,Vente,66000,5229,,LES CHAMPS,B029,50640,50570,Savigny-le-Vieux,50,,,50570000ZC0087,,,,,,,,,,,,,0,3,Dépendance,,0,S,sols,,,2000,-1.041331,48.530245
2023-662500,2023-01-10,000001,Vente,66000,5229,,LES CHAMPS,B029,50640,50570,Savigny-le-Vieux,50,,,50570000ZC0087,,,,,,,,,,,,,0,3,Dépendance,,0,S,sols,,,2000,-1.041331,48.530245
2023-662500,2023-01-10,000001,Vente,66000,5229,,LES CHAMPS,B029,50640,50570,Savigny-le-Vieux,50,,,50570000ZC0087,,,,,,,,,,,,,0,3,Dépendance,,0,S,sols,,,2000,-1.041331,48.530245
2023-662500,2023-01-10,000001,Vente,66000,5229,,LES CHAMPS,B029,50640,50570,Savigny-le-Vieux,50,,,50570000ZC0087,,,,,,,,,,,,,0,3,Dépendance,,0,VE,vergers,,,6134,-1.041331,48.530245
2023-662500,2023-01-10,000001,Vente,66000,5229,,LES CHAMPS,B029,50640,50570,Savigny-le-Vieux,50,,,50570000ZC0087,,,,,,,,,,,,,0,3,Dépendance,,0,S,sols,,,2000,-1.041331,48.530245
2023-662500,2023-01-10,000001,Vente,66000,5229,,LES CHAMPS,B029,50640,50570,Savigny-le-Vieux,50,,,50570000ZC0087,,,,,,,,,,,,,0,1,Maison,104,3,S,sols,,,2000,-1.041331,48.530245
2023-662500,2023-01-10,000001,Vente,66000,5229,,LES CHAMPS,B029,50640,50570,Savigny-le-Vieux,50,,,50570000ZC0087,,,,,,,,,,,,,0,3,Dépendance,,0,VE,vergers,,,6134,-1.041331,48.530245
2023-662500,2023-01-10,000001,Vente,66000,5229,,LES CHAMPS,B029,50640,50570,Savigny-le-Vieux,50,,,50570000ZC0087,,,,,,,,,,,,,0,1,Maison,104,3,VE,vergers,,,6134,-1.041331,48.530245
2023-662500,2023-01-10,000001,Vente,66000,5229,,LES CHAMPS,B029,50640,50570,Savigny-le-Vieux,50,,,50570000ZC0087,,,,,,,,,,,,,0,3,Dépendance,,0,VE,vergers,,,6134,-1.041331,48.530245
2023-663387,2023-02-09,000001,Vente,143910,629,,RTE DE BUAIS,0085,50640,50570,Savigny-le-Vieux,50,,,50570000ZC0064,,,,,,,,,,,,,0,3,Dépendance,,0,S,sols,,,1999,-1.038868,48.52558
2023-663387,2023-02-09,000001,Vente,143910,629,,RTE DE BUAIS,0085,50640,50570,Savigny-le-Vieux,50,,,50570000ZC0064,,,,,,,,,,,,,0,1,Maison,120,3,S,sols,,,1999,-1.038868,48.52558
2023-664068,2023-02-28,000001,Vente,2500,,,LE BOURG,B019,50640,50570,Savigny-le-Vieux,50,,,50570000ZW0030,,,,,,,,,,,,,0,,,,,J,jardins,,,547,-1.04866,48.522061
2023-664081,2023-03-10,000002,Echange,18225,,,LA TIRONNIERE,B105,50640,50570,Savigny-le-Vieux,50,,,50570000ZV0024,,,,,,,,,,,,,0,,,,,T,terres,,,6433,-1.043643,48.520734
2023-664081,2023-03-10,000002,Echange,18225,,,LA TIRONNIERE,B105,50640,50570,Savigny-le-Vieux,50,,,50570000ZV0025,,,,,,,,,,,,,0,,,,,T,terres,,,8756,-1.042923,48.520527
2023-664105,2023-03-06,000001,Vente,235885,584,,RTE DE BUAIS,0085,50640,50570,Savigny-le-Vieux,50,,,50570000ZV0034,,,,,,,,,,,,,0,1,Maison,38,3,J,jardins,,,905,-1.039484,48.524844
2023-664105,2023-03-06,000001,Vente,235885,584,,RTE DE BUAIS,0085,50640,50570,Savigny-le-Vieux,50,,,50570000ZV0034,,,,,,,,,,,,,0,1,Maison,266,6,S,sols,,,1691,-1.039484,48.524844
2023-664105,2023-03-06,000001,Vente,235885,584,,RTE DE BUAIS,0085,50640,50570,Savigny-le-Vieux,50,,,50570000ZV0034,,,,,,,,,,,,,0,1,Maison,34,3,S,sols,,,1691,-1.039484,48.524844
2023-664105,2023-03-06,000001,Vente,235885,584,,RTE DE BUAIS,0085,50640,50570,Savigny-le-Vieux,50,,,50570000ZV0034,,,,,,,,,,,,,0,1,Maison,38,3,S,sols,,,1691,-1.039484,48.524844
2023-664105,2023-03-06,000001,Vente,235885,584,,RTE DE BUAIS,0085,50640,50570,Savigny-le-Vieux,50,,,50570000ZV0034,,,,,,,,,,,,,0,3,Dépendance,,0,S,sols,,,1691,-1.039484,48.524844
2023-664105,2023-03-06,000001,Vente,235885,584,,RTE DE BUAIS,0085,50640,50570,Savigny-le-Vieux,50,,,50570000ZV0034,,,,,,,,,,,,,0,3,Dépendance,,0,S,sols,,,1691,-1.039484,48.524844
2023-664105,2023-03-06,000001,Vente,235885,584,,RTE DE BUAIS,0085,50640,50570,Savigny-le-Vieux,50,,,50570000ZV0034,,,,,,,,,,,,,0,3,Dépendance,,0,J,jardins,,,905,-1.039484,48.524844
2023-664105,2023-03-06,000001,Vente,235885,584,,RTE DE BUAIS,0085,50640,50570,Savigny-le-Vieux,50,,,50570000ZV0034,,,,,,,,,,,,,0,1,Maison,34,3,J,jardins,,,905,-1.039484,48.524844
2023-664105,2023-03-06,000001,Vente,235885,584,,RTE DE BUAIS,0085,50640,50570,Savigny-le-Vieux,50,,,50570000ZV0034,,,,,,,,,,,,,0,1,Maison,266,6,J,jardins,,,905,-1.039484,48.524844
2023-664105,2023-03-06,000001,Vente,235885,584,,RTE DE BUAIS,0085,50640,50570,Savigny-le-Vieux,50,,,50570000ZV0034,,,,,,,,,,,,,0,3,Dépendance,,0,J,jardins,,,905,-1.039484,48.524844
2023-664106,2023-03-06,000001,Vente,164686,,,LA BESNARDIERE,B012,50640,50570,Savigny-le-Vieux,50,,,50570000ZH0043,,,,,,,,,,,,,0,,,,,P,prés,,,3142,-0.993973,48.534849
2023-666706,2023-05-22,000001,Vente,140000,442,,RTE DU GUE,0135,50640,50570,Savigny-le-Vieux,50,,,50570000ZP0028,,,,,,,,,,,,,0,1,Maison,68,4,T,terres,,,1990,-1.00549,48.502024
2023-666706,2023-05-22,000001,Vente,140000,442,,RTE DU GUE,0135,50640,50570,Savigny-le-Vieux,50,,,50570000ZP0028,,,,,,,,,,,,,0,1,Maison,68,4,S,sols,,,3018,-1.00549,48.502024
2023-667229,2023-06-08,000001,Vente,134000,110,,RTE DE LANDIVY,0105,50640,50570,Savigny-le-Vieux,50,,,50570000ZT0025,,,,,,,,,,,,,0,3,Dépendance,,0,S,sols,,,686,-1.0459,48.518798
2023-667229,2023-06-08,000001,Vente,134000,110,,RTE DE LANDIVY,0105,50640,50570,Savigny-le-Vieux,50,,,50570000ZT0025,,,,,,,,,,,,,0,1,Maison,110,3,S,sols,,,686,-1.0459,48.518798
2023-667229,2023-06-08,000001,Vente,134000,,,LA CHAPELLE,B030,50640,50570,Savigny-le-Vieux,50,,,50570000ZT0026,,,,,,,,,,,,,0,,,,,T,terres,,,2024,-1.045385,48.51903
2023-668131,2023-06-22,000001,Vente,30.9,,,LA MAILLARDIERE,B079,50640,50570,Savigny-le-Vieux,50,,,50570000ZI0063,,,,,,,,,,,,,0,,,,,S,sols,,,103,-0.999585,48.517614
2023-668170,2023-06-23,000001,Vente,61.5,,,LA MAILLARDIERE,B079,50640,50570,Savigny-le-Vieux,50,,,50570000ZI0064,,,,,,,,,,,,,0,,,,,S,sols,,,111,-0.999307,48.517637
2023-668170,2023-06-23,000001,Vente,61.5,,,LA MAILLARDIERE,B079,50640,50570,Savigny-le-Vieux,50,,,50570000ZI0066,,,,,,,,,,,,,0,,,,,S,sols,,,94,-0.997677,48.517764
2023-668345,2023-07-05,000001,Vente,50000,19,,RUE DE L ABBAYE,0145,50640,50570,Savigny-le-Vieux,50,,,50570000ZW0059,,,,,,,,,,,,,0,1,Maison,107,1,S,sols,,,134,-1.048449,48.521199
2023-668345,2023-07-05,000001,Vente,50000,7,,RUE DE L ABBAYE,0145,50640,50570,Savigny-le-Vieux,50,,,50570000ZW0060,,,,,,,,,,,,,0,4,Local industriel. commercial ou assimilé,103,0,S,sols,,,264,-1.048446,48.521328
2023-668345,2023-07-05,000001,Vente,50000,7,,RUE DE L ABBAYE,0145,50640,50570,Savigny-le-Vieux,50,,,50570000ZW0060,,,,,,,,,,,,,0,3,Dépendance,,0,S,sols,,,264,-1.048446,48.521328
2023-668345,2023-07-05,000001,Vente,50000,7,,RUE DE L ABBAYE,0145,50640,50570,Savigny-le-Vieux,50,,,50570000ZW0060,,,,,,,,,,,,,0,1,Maison,59,2,S,sols,,,264,-1.048446,48.521328
2023-668345,2023-07-05,000001,Vente,50000,,,LE BOURG,B019,50640,50570,Savigny-le-Vieux,50,,,50570000ZW0136,,,,,,,,,,,,,0,,,,,J,jardins,,,203,-1.048308,48.521303
2023-668345,2023-07-05,000001,Vente,50000,,,LE BOURG,B019,50640,50570,Savigny-le-Vieux,50,,,50570000ZW0139,,,,,,,,,,,,,0,,,,,S,sols,,,52,-1.048271,48.52118
2023-668772,2023-07-19,000001,Vente,95000,1155,,RTE DE SAINT HILAIRE,0110,50640,50570,Savigny-le-Vieux,50,,,50570000ZA0023,,,,,,,,,,,,,0,3,Dépendance,,0,S,sols,,,1500,-1.044232,48.53287
2023-668772,2023-07-19,000001,Vente,95000,1155,,RTE DE SAINT HILAIRE,0110,50640,50570,Savigny-le-Vieux,50,,,50570000ZA0023,,,,,,,,,,,,,0,1,Maison,100,3,S,sols,,,1500,-1.044232,48.53287
2023-668772,2023-07-19,000001,Vente,95000,1155,,RTE DE SAINT HILAIRE,0110,50640,50570,Savigny-le-Vieux,50,,,50570000ZA0023,,,,,,,,,,,,,0,3,Dépendance,,0,T,terres,,,864,-1.044232,48.53287
2023-668772,2023-07-19,000001,Vente,95000,1155,,RTE DE SAINT HILAIRE,0110,50640,50570,Savigny-le-Vieux,50,,,50570000ZA0023,,,,,,,,,,,,,0,1,Maison,100,3,T,terres,,,864,-1.044232,48.53287
2023-668772,2023-07-19,000001,Vente,95000,,,LES CHATEAUX,B032,50640,50570,Savigny-le-Vieux,50,,,50570000ZA0078,,,,,,,,,,,,,0,,,,,T,terres,,,25,-1.04419,48.532832
2023-668772,2023-07-19,000001,Vente,95000,,,LA CROIX GESLIN,B044,50640,50570,Savigny-le-Vieux,50,,,50570000ZC0005,,,,,,,,,,,,,0,,,,,T,terres,,,3400,-1.043128,48.532598
2023-670467,2023-09-11,000001,Vente,158240,86,,RUE DE L ABBAYE,0145,50640,50570,Savigny-le-Vieux,50,,,50570000ZW0073,,,,,,,,,,,,,0,3,Dépendance,,0,S,sols,,,936,-1.048181,48.52054
2023-670467,2023-09-11,000001,Vente,158240,86,,RUE DE L ABBAYE,0145,50640,50570,Savigny-le-Vieux,50,,,50570000ZW0073,,,,,,,,,,,,,0,1,Maison,104,7,S,sols,,,936,-1.048181,48.52054
2023-670467,2023-09-11,000001,Vente,158240,86,,RUE DE L ABBAYE,0145,50640,50570,Savigny-le-Vieux,50,,,50570000ZW0073,,,,,,,,,,,,,0,3,Dépendance,,0,S,sols,,,936,-1.048181,48.52054
2023-672167,2023-08-18,000001,Vente,250000,1305,,IMP DE L ALLERAY,0030,50640,50570,Savigny-le-Vieux,50,,,50570000ZO0042,,,,,,,,,,,,,0,1,Maison,80,4,S,sols,,,182,-1.004188,48.506509
2023-672167,2023-08-18,000001,Vente,250000,,,LA GILAUDAIS,B061,50640,50570,Savigny-le-Vieux,50,,,50570000ZO0043,,,,,,,,,,,,,0,,,,,S,sols,,,596,-1.003749,48.506261
2023-672167,2023-08-18,000001,Vente,250000,,,LA GILAUDAIS,B061,50640,50570,Savigny-le-Vieux,50,,,50570000ZO0044,,,,,,,,,,,,,0,,,,,S,sols,,,1572,-1.003857,48.506071
2023-672167,2023-08-18,000001,Vente,250000,,,LA GILAUDAIS,B061,50640,50570,Savigny-le-Vieux,50,,,50570000ZO0053,,,,,,,,,,,,,0,,,,,T,terres,,,522,-1.004224,48.506314
2023-672395,2023-10-18,000001,Vente,20000,,,LA FOSSE,B058,50640,50570,Savigny-le-Vieux,50,,,50570000ZC0102,,,,,,,,,,,,,0,,,,,T,terres,,,2703,-1.038712,48.526005
2023-672395,2023-10-18,000001,Vente,20000,,,LA FOSSE,B058,50640,50570,Savigny-le-Vieux,50,,,50570000ZC0103,,,,,,,,,,,,,0,,,,,T,terres,,,12883,-1.037677,48.526253
2023-672880,2023-11-13,000001,Vente,127150,,,LA PICANIERE,B097,50640,50570,Savigny-le-Vieux,50,,,50570000ZA0008,,,,,,,,,,,,,0,,,,,S,sols,,,858,-1.04736,48.534862
2023-672880,2023-11-13,000001,Vente,127150,5218,,LA PICANIERE,B097,50640,50570,Savigny-le-Vieux,50,,,50570000ZA0009,,,,,,,,,,,,,0,1,Maison,88,4,S,sols,,,500,-1.046777,48.534838
2023-672880,2023-11-13,000001,Vente,127150,5218,,LA PICANIERE,B097,50640,50570,Savigny-le-Vieux,50,,,50570000ZA0009,,,,,,,,,,,,,0,1,Maison,88,4,J,jardins,,,568,-1.046777,48.534838
2023-672880,2023-11-13,000001,Vente,127150,,,LA PICANIERE,B097,50640,50570,Savigny-le-Vieux,50,,,50570000ZA0010,,,,,,,,,,,,,0,,,,,S,sols,,,349,-1.046978,48.534997
2023-673788,2023-12-12,000001,Vente,170723,,,LA VALLEE,B106,50640,50570,Savigny-le-Vieux,50,,,50570000ZE0099,,,,,,,,,,,,,0,,,,,T,terres,,,143103,-1.014405,48.532589
2023-673865,2023-12-19,000001,Vente,180000,1108,,RTE DE LA CROIX DU CHENE,0095,50640,50570,Savigny-le-Vieux,50,,,50570000ZE0015,,,,,,,,,,,,,0,1,Maison,139,5,VE,vergers,,,2679,-1.008346,48.526803
2023-673865,2023-12-19,000001,Vente,180000,1108,,RTE DE LA CROIX DU CHENE,0095,50640,50570,Savigny-le-Vieux,50,,,50570000ZE0015,,,,,,,,,,,,,0,1,Maison,139,5,S,sols,,,500,-1.008346,48.526803
2023-673973,2023-12-12,000001,Vente,8726,,,LA VALLEE,B106,50640,50570,Savigny-le-Vieux,50,,,50570000ZE0091,,,,,,,,,,,,,0,,,,,BT,taillis simples,,,345,-1.012034,48.531015
2023-673973,2023-12-12,000001,Vente,8726,,,LA VALLEE,B106,50640,50570,Savigny-le-Vieux,50,,,50570000ZE0097,,,,,,,,,,,,,0,,,,,T,terres,,,6927,-1.013071,48.529676
2023-674058,2023-12-18,000001,Vente,3400,,,LA CROIX GESLIN,B044,50640,50570,Savigny-le-Vieux,50,,,50570000ZC0005,,,,,,,,,,,,,0,,,,,T,terres,,,3400,-1.043128,48.532598
