id_mutation,date_mutation,numero_disposition,nature_mutation,valeur_fonciere,adresse_numero,adresse_suffixe,adresse_nom_voie,adresse_code_voie,code_postal,code_commune,nom_commune,code_departement,ancien_code_commune,ancien_nom_commune,id_parcelle,ancien_id_parcelle,numero_volume,lot1_numero,lot1_surface_carrez,lot2_numero,lot2_surface_carrez,lot3_numero,lot3_surface_carrez,lot4_numero,lot4_surface_carrez,lot5_numero,lot5_surface_carrez,nombre_lots,code_type_local,type_local,surface_reelle_bati,nombre_pieces_principales,code_nature_culture,nature_culture,code_nature_culture_speciale,nature_culture_speciale,surface_terrain,longitude,latitude
2023-675223,2023-01-17,000001,Vente,240000,5,,RUE DE L EGLISE,0030,51340,51060,Bignicourt-sur-Saulx,51,,,51060000AB0125,,,,,,,,,,,,,0,1,Maison,135,5,S,sols,,,642,4.770417,48.765351
2023-675223,2023-01-17,000001,Vente,240000,5,,RUE DE L EGLISE,0030,51340,51060,Bignicourt-sur-Saulx,51,,,51060000AB0125,,,,,,,,,,,,,0,3,Dépendance,,0,S,sols,,,642,4.770417,48.765351
2023-675223,2023-01-17,000001,Vente,240000,,,LE VILLAGE,B115,51340,51060,Bignicourt-sur-Saulx,51,,,51060000AB0126,,,,,,,,,,,,,0,,,,,BS,taillis sous futaie,,,1000,4.770704,48.765619
2023-675223,2023-01-17,000001,Vente,240000,,,LE VILLAGE,B115,51340,51060,Bignicourt-sur-Saulx,51,,,51060000AB0127,,,,,,,,,,,,,0,,,,,J,jardins,,,1179,4.770343,48.765611
2023-675797,2023-02-10,000001,Echange,400,,,LE BUISSON HOCQUET,B007,51340,51060,Bignicourt-sur-Saulx,51,,,510600000A0058,,,,,,,,,,,,,0,,,,,BP,peupleraies,,,1800,4.791497,48.777712
2023-675797,2023-02-10,000001,Echange,400,,,LE PRE A L OGNON,B088,51340,51060,Bignicourt-sur-Saulx,51,,,510600000A0262,,,,,,,,,,,,,0,,,,,BP,peupleraies,,,1787,4.786069,48.77599
2023-675797,2023-02-10,000002,Echange,400,,,LES MACUNIERES,B054,51340,51060,Bignicourt-sur-Saulx,51,,,510600000A0305,,,,,,,,,,,,,0,,,,,BP,peupleraies,,,2400,4.78345,48.772783
2023-675944,2023-02-10,000001,Vente,7500,,,LA NOUE DE BRAS,B072,51340,51060,Bignicourt-sur-Saulx,51,,,510600000A0079,,,,,,,,,,,,,0,,,,,BP,peupleraies,,,8098,4.7898,48.774503
2023-675944,2023-02-10,000001,Vente,7500,,,LA NOUE DE BRAS,B072,51340,51060,Bignicourt-sur-Saulx,51,,,510600000A0091,,,,,,,,,,,,,0,,,,,P,prés,,,2403,4.794029,48.776026
2023-676278,2023-02-21,000001,Vente,90000,1,,GR GRANDE RUE,0042,51340,51060,Bignicourt-sur-Saulx,51,,,51060000AB0073,,,,,,,,,,,,,0,1,Maison,72,4,S,sols,,,415,4.775506,48.764539
2023-676278,2023-02-21,000001,Vente,90000,,,LE VILLAGE,B115,51340,51060,Bignicourt-sur-Saulx,51,,,51060000AB0074,,,,,,,,,,,,,0,,,,,J,jardins,,,594,4.775553,48.764255
2023-680428,2023-06-22,000001,Vente,110000,,,LE VILLAGE,B115,51340,51060,Bignicourt-sur-Saulx,51,,,51060000AB0060,,,,,,,,,,,,,0,,,,,J,jardins,,,552,4.77565,48.766018
2023-680428,2023-06-22,000001,Vente,110000,1,,RUE DES DAMES,0024,51340,51060,Bignicourt-sur-Saulx,51,,,51060000AB0062,,,,,,,,,,,,,0,1,Maison,156,4,S,sols,,,741,4.775828,48.765414
2023-680428,2023-06-22,000001,Vente,110000,,,LE VILLAGE,B115,51340,51060,Bignicourt-sur-Saulx,51,,,51060000AB0185,,,,,,,,,,,,,0,,,,,J,jardins,,,63,4.775769,48.765358
2023-680508,2023-06-28,000001,Vente,90216,,,SORCHAMP,B109,51340,51060,Bignicourt-sur-Saulx,51,,,51060000ZE0030,,,,,,,,,,,,,0,,,,,T,terres,,,66826,4.773586,48.747532
2023-680508,2023-06-28,000001,Vente,90216,,,SORCHAMP,B109,51340,51060,Bignicourt-sur-Saulx,51,,,51060000ZE0030,,,,,,,,,,,,,0,,,,,T,terres,,,33414,4.773586,48.747532
2023-681537,2023-07-20,000001,Vente,28000,18,B,RUE CHAUFFOUR,0018,51340,51060,Bignicourt-sur-Saulx,51,,,51060000AB0215,,,,,,,,,,,,,0,3,Dépendance,,0,S,sols,,,661,4.778963,48.766532
2023-681537,2023-07-20,000001,Vente,28000,18,B,RUE CHAUFFOUR,0018,51340,51060,Bignicourt-sur-Saulx,51,,,51060000AB0215,,,,,,,,,,,,,0,1,Maison,50,1,S,sols,,,661,4.778963,48.766532
2023-681537,2023-07-20,000001,Vente,28000,,,LE VILLAGE,B115,51340,51060,Bignicourt-sur-Saulx,51,,,51060000AB0218,,,,,,,,,,,,,0,,,,,P,prés,,,2227,4.779051,48.766075
2023-683163,2023-09-27,000001,Vente,5000,,,LE PRE NOTRE DAME,B097,51340,51060,Bignicourt-sur-Saulx,51,,,510600000A0034,,,,,,,,,,,,,0,,,,,B,bois,,,1489,4.798308,48.778134
2023-683163,2023-09-27,000001,Vente,5000,,,LE PRE NOTRE DAME,B097,51340,51060,Bignicourt-sur-Saulx,51,,,510600000A0034,,,,,,,,,,,,,0,,,,,BP,peupleraies,,,373,4.798308,48.778134
2023-683163,2023-09-27,000001,Vente,5000,,,LE PRE NOTRE DAME,B097,51340,51060,Bignicourt-sur-Saulx,51,,,510600000A0035,,,,,,,,,,,,,0,,,,,BP,peupleraies,,,825,4.798042,48.778025
2023-683163,2023-09-27,000001,Vente,5000,,,LE PRE NOTRE DAME,B097,51340,51060,Bignicourt-sur-Saulx,51,,,510600000A0035,,,,,,,,,,,,,0,,,,,B,bois,,,3296,4.798042,48.778025
2023-683163,2023-09-27,000001,Vente,5000,,,LE PRE NOTRE DAME,B097,51340,51060,Bignicourt-sur-Saulx,51,,,510600000A0036,,,,,,,,,,,,,0,,,,,B,bois,,,1743,4.797718,48.778042
2023-683163,2023-09-27,000001,Vente,5000,,,LE PRE NOTRE DAME,B097,51340,51060,Bignicourt-sur-Saulx,51,,,510600000A0036,,,,,,,,,,,,,0,,,,,BP,peupleraies,,,436,4.797718,48.778042
