id_mutation,date_mutation,numero_disposition,nature_mutation,valeur_fonciere,adresse_numero,adresse_suffixe,adresse_nom_voie,adresse_code_voie,code_postal,code_commune,nom_commune,code_departement,ancien_code_commune,ancien_nom_commune,id_parcelle,ancien_id_parcelle,numero_volume,lot1_numero,lot1_surface_carrez,lot2_numero,lot2_surface_carrez,lot3_numero,lot3_surface_carrez,lot4_numero,lot4_surface_carrez,lot5_numero,lot5_surface_carrez,nombre_lots,code_type_local,type_local,surface_reelle_bati,nombre_pieces_principales,code_nature_culture,nature_culture,code_nature_culture_speciale,nature_culture_speciale,surface_terrain,longitude,latitude
2023-676180,2023-02-27,000002,Vente,18067.5,,,PL DE L'EGLISE,0030,51290,51223,Écollemont,51,,,512230000A0417,,,,,,,,,,,,,0,,,,,S,sols,,,803,4.732672,48.620972
2023-677978,2023-04-20,000001,Vente,1046,,,LA PIECE SAINT SAUVEUR,B010,51290,51223,Écollemont,51,,,51223000ZB0118,,,,,,,,,,,,,0,,,,,S,sols,,,523,4.74403,48.619142
2023-678816,2023-05-12,000001,Vente,55000,,,LE VILLAGE,B011,51290,51223,Écollemont,51,,,51223000ZB0120,,,,,,,,,,,,,0,,,,,T,terres,,,1569,4.733461,48.619277
2023-678816,2023-05-12,000001,Vente,55000,,,LE VILLAGE,B011,51290,51223,Écollemont,51,,,51223000ZB0121,,,,,,,,,,,,,0,,,,,T,terres,,,1520,4.733755,48.619169
2023-682943,2023-09-13,000001,Vente,2732,,,LA COTE BABEURE,B005,51290,51223,Écollemont,51,,,512230000A0265,,,,,,,,,,,,,0,,,,,VE,vergers,,,1490,4.731315,48.621646
2023-682944,2023-09-13,000002,Vente,2267,,,LA COTE BABEURE,B005,51290,51223,Écollemont,51,,,512230000A0364,,,,,,,,,,,,,0,,,,,VE,vergers,,,948,4.731545,48.621591
2023-682944,2023-09-13,000002,Vente,2267,,,LA COTE BABEURE,B005,51290,51223,Écollemont,51,,,512230000A0367,,,,,,,,,,,,,0,,,,,S,sols,,,288,4.731722,48.62114
2023-684348,2023-11-24,000002,Vente,63000,6,,RUE DE NUISEMENT AUX BOIS,0200,51290,51223,Écollemont,51,,,512230000A0315,,,,,,,,,,,,,0,3,Dépendance,,0,S,sols,,,1093,4.732376,48.6201
2023-684348,2023-11-24,000002,Vente,63000,,,LE VILLAGE,B011,51290,51223,Écollemont,51,,,512230000A0419,,,,,,,,,,,,,0,,,,,S,sols,,,342,4.732122,48.620171
2023-684835,2023-12-29,000001,Vente,38000,,,LE VILLAGE,B011,51290,51223,Écollemont,51,,,512230000A0418,,,,,,,,,,,,,0,,,,,S,sols,,,845,4.731826,48.620128
