id_mutation,date_mutation,numero_disposition,nature_mutation,valeur_fonciere,adresse_numero,adresse_suffixe,adresse_nom_voie,adresse_code_voie,code_postal,code_commune,nom_commune,code_departement,ancien_code_commune,ancien_nom_commune,id_parcelle,ancien_id_parcelle,numero_volume,lot1_numero,lot1_surface_carrez,lot2_numero,lot2_surface_carrez,lot3_numero,lot3_surface_carrez,lot4_numero,lot4_surface_carrez,lot5_numero,lot5_surface_carrez,nombre_lots,code_type_local,type_local,surface_reelle_bati,nombre_pieces_principales,code_nature_culture,nature_culture,code_nature_culture_speciale,nature_culture_speciale,surface_terrain,longitude,latitude
2023-689371,2023-01-31,000001,Vente,109000,12,C,RUE DE L'ANJOU AMPOIGNE,0115,53200,53124,Prée-d'Anjou,53,,,531240040A0114,,,,,,,,,,,,,0,2,Appartement,56,3,S,sols,,,108,-0.825655,47.810619
2023-689371,2023-01-31,000001,Vente,109000,12,C,RUE DE L'ANJOU AMPOIGNE,0115,53200,53124,Prée-d'Anjou,53,,,531240040A0114,,,,,,,,,,,,,0,2,Appartement,66,3,S,sols,,,108,-0.825655,47.810619
2023-689371,2023-01-31,000002,Vente,109000,12,C,RUE DE L'ANJOU AMPOIGNE,0115,53200,53124,Prée-d'Anjou,53,,,531240040A0114,,,,,,,,,,,,,0,2,Appartement,66,3,S,sols,,,108,-0.825655,47.810619
2023-689371,2023-01-31,000002,Vente,109000,12,C,RUE DE L'ANJOU AMPOIGNE,0115,53200,53124,Prée-d'Anjou,53,,,531240040A0114,,,,,,,,,,,,,0,2,Appartement,56,3,S,sols,,,108,-0.825655,47.810619
2023-689450,2023-01-25,000001,Vente,210000,,,LA BEURRERIE,C035,53200,53124,Prée-d'Anjou,53,,,53124004ZD0048,,,,,,,,,,,,,0,,,,,S,sols,,,645,-0.825676,47.817427
2023-689450,2023-01-25,000001,Vente,210000,6,,LA BEURRERIE,C035,53200,53124,Prée-d'Anjou,53,,,53124004ZD0080,,,,,,,,,,,,,0,1,Maison,140,4,P,prés,,,1883,-0.826486,47.817057
2023-689450,2023-01-25,000001,Vente,210000,6,,LA BEURRERIE,C035,53200,53124,Prée-d'Anjou,53,,,53124004ZD0080,,,,,,,,,,,,,0,1,Maison,140,4,S,sols,,,2176,-0.826486,47.817057
2023-689450,2023-01-25,000001,Vente,210000,6,,LA BEURRERIE,C035,53200,53124,Prée-d'Anjou,53,,,53124004ZD0080,,,,,,,,,,,,,0,1,Maison,140,4,J,jardins,,,821,-0.826486,47.817057
2023-689936,2023-02-24,000001,Vente,140000,5,,RUE DE L'ANJOU AMPOIGNE,0115,53200,53124,Prée-d'Anjou,53,,,531240040A0066,,,,,,,,,,,,,0,1,Maison,113,4,S,sols,,,238,-0.825484,47.810114
2023-689936,2023-02-24,000001,Vente,140000,7,,RUE DE L'ANJOU AMPOIGNE,0115,53200,53124,Prée-d'Anjou,53,,,531240040A0731,,,,,,,,,,,,,0,,,,,S,sols,,,29,-0.825412,47.810054
2023-689936,2023-02-24,000001,Vente,140000,,,RUE DE L'ANJOU AMPOIGNE,0115,53200,53124,Prée-d'Anjou,53,,,531240040A0733,,,,,,,,,,,,,0,,,,,J,jardins,,,24,-0.82531,47.81002
2023-689939,2023-02-24,000001,Vente,212500,4,,RUE DES COLVERTS,0029,53200,53124,Prée-d'Anjou,53,,,531240000B1100,,,,,,,,,,,,,0,1,Maison,128,6,S,sols,,,913,-0.817812,47.837952
2023-690195,2023-03-03,000001,Vente,28305,,,LE GRAND ORMEAU,B267,53200,53124,Prée-d'Anjou,53,,,531240000A0965,,,,,,,,,,,,,0,,,,,AB,terrains a bâtir,,,629,-0.821608,47.843842
2023-690340,2023-03-03,000001,Vente,31230,,,LE GRAND ORMEAU,B267,53200,53124,Prée-d'Anjou,53,,,531240000A0964,,,,,,,,,,,,,0,,,,,AB,terrains a bâtir,,,694,-0.821664,47.843627
2023-690363,2023-03-22,000001,Vente,16000,,,PL DE L EGLISE,0040,53200,53124,Prée-d'Anjou,53,,,531240000B0100,,,,,,,,,,,,,0,,,,,J,jardins,,,94,-0.817752,47.841136
2023-690363,2023-03-22,000001,Vente,16000,,,PL DE L EGLISE,0040,53200,53124,Prée-d'Anjou,53,,,531240000B0100,,,,,,,,,,,,,0,,,,,S,sols,,,10,-0.817752,47.841136
2023-690363,2023-03-22,000001,Vente,16000,13,,RUE D ANJOU LAIGNE,0011,53200,53124,Prée-d'Anjou,53,,,531240000B0104,,,2,,,,,,,,,,1,1,Maison,56,1,,,,,,-0.818117,47.841136
2023-690803,2023-03-21,000001,Vente,193000,1,,LE PETIT CHERIPEAU,C421,53200,53124,Prée-d'Anjou,53,,,53124004ZA0004,,,,,,,,,,,,,0,1,Maison,136,6,P,prés,,,10000,-0.848556,47.823737
2023-690803,2023-03-21,000001,Vente,193000,1,,LE PETIT CHERIPEAU,C421,53200,53124,Prée-d'Anjou,53,,,53124004ZA0004,,,,,,,,,,,,,0,1,Maison,136,6,BT,taillis simples,CHAT,Châtaigneraie,4000,-0.848556,47.823737
2023-690803,2023-03-21,000001,Vente,193000,1,,LE PETIT CHERIPEAU,C421,53200,53124,Prée-d'Anjou,53,,,53124004ZA0004,,,,,,,,,,,,,0,3,Dépendance,,0,BT,taillis simples,CHAT,Châtaigneraie,4000,-0.848556,47.823737
2023-690803,2023-03-21,000001,Vente,193000,1,,LE PETIT CHERIPEAU,C421,53200,53124,Prée-d'Anjou,53,,,53124004ZA0004,,,,,,,,,,,,,0,1,Maison,136,6,S,sols,,,11610,-0.848556,47.823737
2023-690803,2023-03-21,000001,Vente,193000,1,,LE PETIT CHERIPEAU,C421,53200,53124,Prée-d'Anjou,53,,,53124004ZA0004,,,,,,,,,,,,,0,3,Dépendance,,0,T,terres,,,72270,-0.848556,47.823737
2023-690803,2023-03-21,000001,Vente,193000,1,,LE PETIT CHERIPEAU,C421,53200,53124,Prée-d'Anjou,53,,,53124004ZA0004,,,,,,,,,,,,,0,3,Dépendance,,0,S,sols,,,11610,-0.848556,47.823737
2023-690803,2023-03-21,000001,Vente,193000,1,,LE PETIT CHERIPEAU,C421,53200,53124,Prée-d'Anjou,53,,,53124004ZA0004,,,,,,,,,,,,,0,1,Maison,136,6,T,terres,,,72270,-0.848556,47.823737
2023-690803,2023-03-21,000001,Vente,193000,1,,LE PETIT CHERIPEAU,C421,53200,53124,Prée-d'Anjou,53,,,53124004ZA0004,,,,,,,,,,,,,0,3,Dépendance,,0,T,terres,,,50878,-0.848556,47.823737
2023-690803,2023-03-21,000001,Vente,193000,1,,LE PETIT CHERIPEAU,C421,53200,53124,Prée-d'Anjou,53,,,53124004ZA0004,,,,,,,,,,,,,0,1,Maison,136,6,T,terres,,,50878,-0.848556,47.823737
2023-690803,2023-03-21,000001,Vente,193000,1,,LE PETIT CHERIPEAU,C421,53200,53124,Prée-d'Anjou,53,,,53124004ZA0004,,,,,,,,,,,,,0,3,Dépendance,,0,VE,vergers,POMME,Pommiers,5274,-0.848556,47.823737
2023-690803,2023-03-21,000001,Vente,193000,1,,LE PETIT CHERIPEAU,C421,53200,53124,Prée-d'Anjou,53,,,53124004ZA0004,,,,,,,,,,,,,0,3,Dépendance,,0,P,prés,,,10000,-0.848556,47.823737
2023-690803,2023-03-21,000001,Vente,193000,1,,LE PETIT CHERIPEAU,C421,53200,53124,Prée-d'Anjou,53,,,53124004ZA0004,,,,,,,,,,,,,0,1,Maison,136,6,VE,vergers,POMME,Pommiers,5274,-0.848556,47.823737
2023-690803,2023-03-21,000001,Vente,193000,1,,LE PETIT CHERIPEAU,C421,53200,53124,Prée-d'Anjou,53,,,53124004ZA0004,,,,,,,,,,,,,0,3,Dépendance,,0,T,terres,,,7918,-0.848556,47.823737
2023-690803,2023-03-21,000001,Vente,193000,1,,LE PETIT CHERIPEAU,C421,53200,53124,Prée-d'Anjou,53,,,53124004ZA0004,,,,,,,,,,,,,0,1,Maison,136,6,T,terres,,,7918,-0.848556,47.823737
2023-690803,2023-03-21,000001,Vente,193000,,,LE PETIT CHERIPEAU,C421,53200,53124,Prée-d'Anjou,53,,,53124004ZA0007,,,,,,,,,,,,,0,,,,,P,prés,,,9480,-0.844569,47.819527
2023-691794,2023-05-30,000001,Vente,7000,,,LE CHEMIN LAIGNE,B106,53200,53124,Prée-d'Anjou,53,,,531240000C1039,,,,,,,,,,,,,0,,,,,T,terres,,,233,-0.868836,47.84122
2023-691794,2023-05-30,000001,Vente,7000,,,ROCHE TAILLIS,B854,53200,53124,Prée-d'Anjou,53,,,531240000C1121,,,,,,,,,,,,,0,,,,,T,terres,,,7924,-0.868461,47.841751
2023-691794,2023-05-30,000001,Vente,7000,,,ROCHE TAILLIS,B854,53200,53124,Prée-d'Anjou,53,,,531240000C1121,,,,,,,,,,,,,0,,,,,S,sols,,,5000,-0.868461,47.841751
2023-692048,2023-06-08,000001,Vente,250000,1,,LA COUTURE,C207,53200,53124,Prée-d'Anjou,53,,,53124004ZN0015,,,,,,,,,,,,,0,1,Maison,136,5,J,jardins,,,489,-0.823341,47.790221
2023-692048,2023-06-08,000001,Vente,250000,1,,LA COUTURE,C207,53200,53124,Prée-d'Anjou,53,,,53124004ZN0015,,,,,,,,,,,,,0,1,Maison,136,5,S,sols,,,2831,-0.823341,47.790221
2023-692052,2023-06-08,000002,Vente,105500,,,LIMESLE,C369,53200,53124,Prée-d'Anjou,53,,,53124004ZT0009,,,,,,,,,,,,,0,,,,,E,eaux,FOSSE,Fosse,1720,-0.825742,47.797743
2023-692052,2023-06-08,000002,Vente,105500,,,LE VIEIL HETRE,C888,53200,53124,Prée-d'Anjou,53,,,53124004ZT0023,,,,,,,,,,,,,0,,,,,T,terres,,,956,-0.823712,47.795632
2023-692052,2023-06-08,000002,Vente,105500,,,LE VIEIL HETRE,C888,53200,53124,Prée-d'Anjou,53,,,53124004ZT0025,,,,,,,,,,,,,0,,,,,T,terres,,,112200,-0.823207,47.795467
2023-692052,2023-06-08,000002,Vente,105500,,,LE VIEIL HETRE,C888,53200,53124,Prée-d'Anjou,53,,,53124004ZT0025,,,,,,,,,,,,,0,,,,,T,terres,,,31676,-0.823207,47.795467
2023-692052,2023-06-08,000002,Vente,105500,,,LE VIEIL HETRE,C888,53200,53124,Prée-d'Anjou,53,,,53124004ZT0025,,,,,,,,,,,,,0,,,,,S,sols,,,1124,-0.823207,47.795467
2023-692255,2023-06-30,000001,Vente,55000,6,,RUE DU MAINE,0075,53200,53124,Prée-d'Anjou,53,,,531240000B0682,,,,,,,,,,,,,0,,,,,S,sols,,,465,-0.816937,47.841644
2023-692331,2023-06-30,000002,Vente,95000,1,,RUE DE LA CHARMILLE,0018,53200,53124,Prée-d'Anjou,53,,,531240000A0970,,,,,,,,,,,,,0,1,Maison,81,4,S,sols,,,377,-0.818487,47.843856
2023-692331,2023-06-30,000002,Vente,95000,1,,RUE DE LA CHARMILLE,0018,53200,53124,Prée-d'Anjou,53,,,531240000A0970,,,,,,,,,,,,,0,1,Maison,80,4,S,sols,,,377,-0.818487,47.843856
2023-692614,2023-07-03,000001,Vente,85000,8,,RUE DU MAINE,0075,53200,53124,Prée-d'Anjou,53,,,531240000B0681,,,,,,,,,,,,,0,3,Dépendance,,0,S,sols,,,382,-0.816786,47.841639
2023-692614,2023-07-03,000001,Vente,85000,8,,RUE DU MAINE,0075,53200,53124,Prée-d'Anjou,53,,,531240000B0681,,,,,,,,,,,,,0,1,Maison,66,4,S,sols,,,382,-0.816786,47.841639
2023-692720,2023-07-12,000001,Vente,157500,1,,RUE DU FRESNE,0130,53200,53124,Prée-d'Anjou,53,,,53124004ZV0099,,,,,,,,,,,,,0,1,Maison,95,5,S,sols,,,549,-0.826859,47.808354
2023-692783,2023-06-30,000002,Vente,95000,22,B,RUE DU PETIT SAPIN,0090,53200,53124,Prée-d'Anjou,53,,,531240000A0939,,,,,,,,,,,,,0,1,Maison,102,4,S,sols,,,194,-0.816799,47.844739
2023-692783,2023-06-30,000002,Vente,95000,,,RUE DU PETIT SAPIN,0090,53200,53124,Prée-d'Anjou,53,,,531240000A0954,,,,,,,,,,,,,0,,,,,S,sols,,,157,-0.81688,47.844765
2023-693445,2023-08-29,000001,Vente,126660,,,L ORVENIERE,C400,53200,53124,Prée-d'Anjou,53,,,53124004ZC0034,,,,,,,,,,,,,0,,,,,T,terres,,,61652,-0.836424,47.82597
2023-693445,2023-08-29,000001,Vente,126660,,,L ORVENIERE,C400,53200,53124,Prée-d'Anjou,53,,,53124004ZC0034,,,,,,,,,,,,,0,,,,,T,terres,,,191668,-0.836424,47.82597
2023-693481,2023-08-21,000001,Vente,253000,1,,LA HEURIERE,C332,53200,53124,Prée-d'Anjou,53,,,53124004ZP0011,,,,,,,,,,,,,0,1,Maison,137,2,E,eaux,MARE,Mare,690,-0.815711,47.771729
2023-693481,2023-08-21,000001,Vente,253000,1,,LA HEURIERE,C332,53200,53124,Prée-d'Anjou,53,,,53124004ZP0011,,,,,,,,,,,,,0,1,Maison,137,2,T,terres,,,4288,-0.815711,47.771729
2023-693481,2023-08-21,000001,Vente,253000,1,,LA HEURIERE,C332,53200,53124,Prée-d'Anjou,53,,,53124004ZP0011,,,,,,,,,,,,,0,3,Dépendance,,0,T,terres,,,4288,-0.815711,47.771729
2023-693481,2023-08-21,000001,Vente,253000,1,,LA HEURIERE,C332,53200,53124,Prée-d'Anjou,53,,,53124004ZP0011,,,,,,,,,,,,,0,3,Dépendance,,0,T,terres,,,4288,-0.815711,47.771729
2023-693481,2023-08-21,000001,Vente,253000,1,,LA HEURIERE,C332,53200,53124,Prée-d'Anjou,53,,,53124004ZP0011,,,,,,,,,,,,,0,3,Dépendance,,0,E,eaux,MARE,Mare,690,-0.815711,47.771729
2023-693481,2023-08-21,000001,Vente,253000,1,,LA HEURIERE,C332,53200,53124,Prée-d'Anjou,53,,,53124004ZP0011,,,,,,,,,,,,,0,3,Dépendance,,0,E,eaux,MARE,Mare,690,-0.815711,47.771729
2023-693481,2023-08-21,000001,Vente,253000,1,,LA HEURIERE,C332,53200,53124,Prée-d'Anjou,53,,,53124004ZP0011,,,,,,,,,,,,,0,1,Maison,137,2,J,jardins,,,1004,-0.815711,47.771729
2023-693481,2023-08-21,000001,Vente,253000,1,,LA HEURIERE,C332,53200,53124,Prée-d'Anjou,53,,,53124004ZP0011,,,,,,,,,,,,,0,3,Dépendance,,0,J,jardins,,,1004,-0.815711,47.771729
2023-693481,2023-08-21,000001,Vente,253000,1,,LA HEURIERE,C332,53200,53124,Prée-d'Anjou,53,,,53124004ZP0011,,,,,,,,,,,,,0,3,Dépendance,,0,J,jardins,,,1004,-0.815711,47.771729
2023-693481,2023-08-21,000001,Vente,253000,1,,LA HEURIERE,C332,53200,53124,Prée-d'Anjou,53,,,53124004ZP0011,,,,,,,,,,,,,0,1,Maison,137,2,P,prés,,,1704,-0.815711,47.771729
2023-693481,2023-08-21,000001,Vente,253000,1,,LA HEURIERE,C332,53200,53124,Prée-d'Anjou,53,,,53124004ZP0011,,,,,,,,,,,,,0,3,Dépendance,,0,P,prés,,,1704,-0.815711,47.771729
2023-693481,2023-08-21,000001,Vente,253000,1,,LA HEURIERE,C332,53200,53124,Prée-d'Anjou,53,,,53124004ZP0011,,,,,,,,,,,,,0,3,Dépendance,,0,P,prés,,,1704,-0.815711,47.771729
2023-693481,2023-08-21,000001,Vente,253000,1,,LA HEURIERE,C332,53200,53124,Prée-d'Anjou,53,,,53124004ZP0011,,,,,,,,,,,,,0,1,Maison,137,2,S,sols,,,7013,-0.815711,47.771729
2023-693481,2023-08-21,000001,Vente,253000,1,,LA HEURIERE,C332,53200,53124,Prée-d'Anjou,53,,,53124004ZP0011,,,,,,,,,,,,,0,3,Dépendance,,0,S,sols,,,7013,-0.815711,47.771729
2023-693481,2023-08-21,000001,Vente,253000,1,,LA HEURIERE,C332,53200,53124,Prée-d'Anjou,53,,,53124004ZP0011,,,,,,,,,,,,,0,3,Dépendance,,0,VE,vergers,POMME,Pommiers,961,-0.815711,47.771729
2023-693481,2023-08-21,000001,Vente,253000,1,,LA HEURIERE,C332,53200,53124,Prée-d'Anjou,53,,,53124004ZP0011,,,,,,,,,,,,,0,3,Dépendance,,0,VE,vergers,POMME,Pommiers,961,-0.815711,47.771729
2023-693481,2023-08-21,000001,Vente,253000,1,,LA HEURIERE,C332,53200,53124,Prée-d'Anjou,53,,,53124004ZP0011,,,,,,,,,,,,,0,1,Maison,137,2,VE,vergers,POMME,Pommiers,961,-0.815711,47.771729
2023-693481,2023-08-21,000001,Vente,253000,1,,LA HEURIERE,C332,53200,53124,Prée-d'Anjou,53,,,53124004ZP0011,,,,,,,,,,,,,0,3,Dépendance,,0,S,sols,,,7013,-0.815711,47.771729
2023-693636,2023-09-08,000002,Vente,12883,,,RUE DU CLOSEAU,0028,53200,53124,Prée-d'Anjou,53,,,531240000B0669,,,,,,,,,,,,,0,,,,,S,sols,,,96,-0.816422,47.841459
2023-693636,2023-09-08,000002,Vente,12883,,,RUE DU MAINE,0075,53200,53124,Prée-d'Anjou,53,,,531240000B1087,,,,,,,,,,,,,0,,,,,S,sols,,,34,-0.816137,47.841511
2023-693636,2023-09-08,000002,Vente,12883,,,LE CLOSEAU DU NOYER,B169,53200,53124,Prée-d'Anjou,53,,,531240000B1247,,,,,,,,,,,,,0,,,,,VE,vergers,HAIES,Haies fruitières,238,-0.815853,47.841422
2023-693636,2023-09-08,000002,Vente,12883,12,B,RUE DU MAINE,0075,53200,53124,Prée-d'Anjou,53,,,531240000B1249,,,,,,,,,,,,,0,4,Local industriel. commercial ou assimilé,1200,0,S,sols,,,560,-0.816258,47.841452
2023-693636,2023-09-08,000002,Vente,12883,,,RUE DU MAINE,0075,53200,53124,Prée-d'Anjou,53,,,531240000B1251,,,,,,,,,,,,,0,,,,,S,sols,,,63,-0.815835,47.841502
2023-694072,2023-09-28,000001,Vente,30260.3,,,LE BOUILLAU,B042,53200,53124,Prée-d'Anjou,53,,,531240000D0603,,,,,,,,,,,,,0,,,,,T,terres,,,38,-0.849128,47.861135
2023-694072,2023-09-28,000001,Vente,30260.3,,,LE ROTI LAIGNE,B859,53200,53124,Prée-d'Anjou,53,,,531240000D0616,,,,,,,,,,,,,0,,,,,T,terres,,,12650,-0.850997,47.861574
2023-694072,2023-09-28,000001,Vente,30260.3,,,LE VERGER DU HAUT LAIGNE,B965,53200,53124,Prée-d'Anjou,53,,,531240000D0692,,,,,,,,,,,,,0,,,,,VE,vergers,POMME,Pommiers,478,-0.852939,47.861804
2023-694072,2023-09-28,000001,Vente,30260.3,,,LE VERGER DE L AIRE LAIGNE,B920,53200,53124,Prée-d'Anjou,53,,,531240000D0696,,,,,,,,,,,,,0,,,,,VE,vergers,POMME,Pommiers,44,-0.852932,47.862077
2023-694072,2023-09-28,000001,Vente,30260.3,,,CHEMIN DE LA BOUGUELIERE,B112,53200,53124,Prée-d'Anjou,53,,,531240000D0697,,,,,,,,,,,,,0,,,,,P,prés,,,168,-0.852818,47.862026
2023-694072,2023-09-28,000001,Vente,30260.3,,,LA PIECE DE LA CROIX LAI,B593,53200,53124,Prée-d'Anjou,53,,,531240000D0698,,,,,,,,,,,,,0,,,,,T,terres,,,80,-0.852861,47.862091
2023-694072,2023-09-28,000001,Vente,30260.3,,,CHEMIN DE LA BOUGUELIERE,B112,53200,53124,Prée-d'Anjou,53,,,531240000D0700,,,,,,,,,,,,,0,,,,,P,prés,,,1378,-0.851603,47.862283
2023-694072,2023-09-28,000001,Vente,30260.3,,,LA GRANDE PIECE LAIGNE,B316,53200,53124,Prée-d'Anjou,53,,,531240000D0701,,,,,,,,,,,,,0,,,,,T,terres,,,7000,-0.851164,47.862187
2023-694072,2023-09-28,000001,Vente,30260.3,,,LA GRANDE PIECE LAIGNE,B316,53200,53124,Prée-d'Anjou,53,,,531240000D0702,,,,,,,,,,,,,0,,,,,T,terres,,,6580,-0.85105,47.861782
2023-694072,2023-09-28,000001,Vente,30260.3,,,LE CORMIER LAIGNE,B176,53200,53124,Prée-d'Anjou,53,,,531240000D0723,,,,,,,,,,,,,0,,,,,T,terres,,,313,-0.852801,47.861517
2023-694072,2023-09-28,000001,Vente,30260.3,,,LA PIECE DE LA CROIX LAI,B593,53200,53124,Prée-d'Anjou,53,,,531240000D0948,,,,,,,,,,,,,0,,,,,T,terres,,,14,-0.852957,47.862221
2023-694072,2023-09-28,000001,Vente,30260.3,,,LA PIECE DE LA CROIX LAI,B593,53200,53124,Prée-d'Anjou,53,,,531240000D0949,,,,,,,,,,,,,0,,,,,T,terres,,,14486,-0.852219,47.862649
2023-694361,2023-09-25,000001,Vente,38655,,,LE GRAND ORMEAU,B267,53200,53124,Prée-d'Anjou,53,,,531240000A0962,,,,,,,,,,,,,0,,,,,AB,terrains a bâtir,,,423,-0.822135,47.843963
2023-694361,2023-09-25,000001,Vente,38655,,,LE GRAND ORMEAU,B267,53200,53124,Prée-d'Anjou,53,,,531240000A0963,,,,,,,,,,,,,0,,,,,AB,terrains a bâtir,,,436,-0.822168,47.843772
2023-694542,2023-10-20,000001,Vente,75902.02,,,LE FELUAIS,B229,53200,53124,Prée-d'Anjou,53,,,531240000C0473,,,,,,,,,,,,,0,,,,,T,terres,,,3160,-0.868804,47.836668
2023-694542,2023-10-20,000001,Vente,75902.02,,,LE JONCHERAY,B374,53200,53124,Prée-d'Anjou,53,,,531240000C0990,,,,,,,,,,,,,0,,,,,T,terres,,,36169,-0.871111,47.837681
2023-694542,2023-10-20,000001,Vente,75902.02,,,LA CHESNAIE LAIGNE,B146,53200,53124,Prée-d'Anjou,53,,,531240000C0992,,,,,,,,,,,,,0,,,,,T,terres,,,7860,-0.8658,47.833789
2023-694542,2023-10-20,000001,Vente,75902.02,,,LA CHESNAIE LAIGNE,B146,53200,53124,Prée-d'Anjou,53,,,531240000C0992,,,,,,,,,,,,,0,,,,,T,terres,,,14936,-0.8658,47.833789
2023-694542,2023-10-20,000001,Vente,75902.02,,,LA VIGNE LAIGNE,B989,53200,53124,Prée-d'Anjou,53,,,531240000C0993,,,,,,,,,,,,,0,,,,,T,terres,,,9820,-0.868124,47.83541
2023-694542,2023-10-20,000001,Vente,75902.02,,,LA VIGNE LAIGNE,B989,53200,53124,Prée-d'Anjou,53,,,531240000C0993,,,,,,,,,,,,,0,,,,,T,terres,,,19994,-0.868124,47.83541
2023-694547,2023-10-20,000001,Vente,21062.58,,,LE BOIS SALMON,B035,53200,53124,Prée-d'Anjou,53,,,531240000C0991,,,,,,,,,,,,,0,,,,,T,terres,,,26411,-0.864483,47.835818
2023-694547,2023-10-20,000001,Vente,21062.58,,,LE BOIS SALMON,B035,53200,53124,Prée-d'Anjou,53,,,531240000C0991,,,,,,,,,,,,,0,,,,,T,terres,,,17017,-0.864483,47.835818
2023-694572,2023-10-23,000001,Vente,130000,4,,CHE DE LA RITEE,0128,53200,53124,Prée-d'Anjou,53,,,53124004ZV0070,,,,,,,,,,,,,0,1,Maison,90,5,S,sols,,,819,-0.823075,47.809497
2023-694769,2023-10-20,000001,Vente,181771,1,,RUE DE LA PERRIERE,0124,53200,53124,Prée-d'Anjou,53,,,53124004ZW0029,,,,,,,,,,,,,0,1,Maison,94,5,S,sols,,,1072,-0.826862,47.810457
2023-694833,2023-10-25,000002,Vente,471000,,,LA BOUILLERIE,C051,53200,53124,Prée-d'Anjou,53,,,53124004ZT0015,,,,,,,,,,,,,0,,,,,T,terres,,,29275,-0.834029,47.791237
2023-694833,2023-10-25,000002,Vente,471000,,,LA BOUILLERIE,C051,53200,53124,Prée-d'Anjou,53,,,53124004ZT0015,,,,,,,,,,,,,0,,,,,T,terres,,,29275,-0.834029,47.791237
2023-694975,2023-10-31,000001,Vente,2000,,,LES HULAIRIES,B361,53200,53124,Prée-d'Anjou,53,,,531240000B0983,,,,,,,,,,,,,0,,,,,T,terres,,,1218,-0.787082,47.824635
2023-695295,2023-11-08,000001,Vente,187500,,,LA MARE LAIGNE,B408,53200,53124,Prée-d'Anjou,53,,,531240000D0514,,,,,,,,,,,,,0,,,,,E,eaux,MARE,Mare,667,-0.856004,47.849499
2023-695295,2023-11-08,000001,Vente,187500,,,L AIRE LAIGNE,B001,53200,53124,Prée-d'Anjou,53,,,531240000D0515,,,,,,,,,,,,,0,,,,,S,sols,,,1295,-0.856598,47.849507
2023-695295,2023-11-08,000001,Vente,187500,,,LE CLOS DU PAILLER,B161,53200,53124,Prée-d'Anjou,53,,,531240000D0516,,,,,,,,,,,,,0,,,,,S,sols,,,4540,-0.856711,47.849052
2023-695295,2023-11-08,000001,Vente,187500,,,LE CORMIER LAIGNE,B176,53200,53124,Prée-d'Anjou,53,,,531240000D1042,,,,,,,,,,,,,0,,,,,S,sols,,,1062,-0.856935,47.848717
2023-695295,2023-11-08,000001,Vente,187500,,,LA PIECE NEUVE LAIGNE,B681,53200,53124,Prée-d'Anjou,53,,,531240000D1044,,,,,,,,,,,,,0,,,,,T,terres,,,15,-0.857326,47.850039
2023-695295,2023-11-08,000001,Vente,187500,,,LE CHEMIN LAIGNE,B106,53200,53124,Prée-d'Anjou,53,,,531240000D1046,,,,,,,,,,,,,0,,,,,T,terres,,,305,-0.857142,47.849944
2023-695295,2023-11-08,000001,Vente,187500,,,LA PIECE DE LA REMISE LAI,B603,53200,53124,Prée-d'Anjou,53,,,531240000D1048,,,,,,,,,,,,,0,,,,,T,terres,,,2670,-0.857019,47.849365
2023-695295,2023-11-08,000001,Vente,187500,,,LA PIECE DE LA REMISE LAI,B603,53200,53124,Prée-d'Anjou,53,,,531240000D1048,,,,,,,,,,,,,0,,,,,S,sols,,,500,-0.857019,47.849365
2023-695295,2023-11-08,000001,Vente,187500,,,LE JARDIN LAIGNE,B363,53200,53124,Prée-d'Anjou,53,,,531240000D1050,,,,,,,,,,,,,0,,,,,J,jardins,,,238,-0.855804,47.849597
2023-695295,2023-11-08,000001,Vente,187500,1,,LA GUESNIERE,B343,53200,53124,Prée-d'Anjou,53,,,531240000D1052,,,,,,,,,,,,,0,1,Maison,126,4,S,sols,,,2717,-0.856406,47.849663
2023-695295,2023-11-08,000001,Vente,187500,1,,LA GUESNIERE,B343,53200,53124,Prée-d'Anjou,53,,,531240000D1052,,,,,,,,,,,,,0,1,Maison,15,1,S,sols,,,2717,-0.856406,47.849663
2023-695295,2023-11-08,000001,Vente,187500,,,LA PIECE DE L AIRE LAIGNE,B578,53200,53124,Prée-d'Anjou,53,,,531240000D1054,,,,,,,,,,,,,0,,,,,S,sols,,,480,-0.856567,47.84992
2023-695295,2023-11-08,000001,Vente,187500,,,LA PIECE DE L AIRE LAIGNE,B578,53200,53124,Prée-d'Anjou,53,,,531240000D1054,,,,,,,,,,,,,0,,,,,T,terres,,,1277,-0.856567,47.84992
2023-695742,2023-12-11,000001,Vente,113000,5,,RUE DU MAINE,0075,53200,53124,Prée-d'Anjou,53,,,531240000B0033,,,,,,,,,,,,,0,1,Maison,104,4,S,sols,,,318,-0.818087,47.842201
2023-695742,2023-12-11,000001,Vente,113000,5,,RUE DU MAINE,0075,53200,53124,Prée-d'Anjou,53,,,531240000B0033,,,,,,,,,,,,,0,3,Dépendance,,0,S,sols,,,318,-0.818087,47.842201
2023-696007,2023-12-21,000001,Vente,25875,14,,,0111,53200,53124,Prée-d'Anjou,53,,,531240000A0961,,,,,,,,,,,,,0,,,,,AB,terrains a bâtir,,,575,-0.822204,47.844186
