id_mutation,date_mutation,numero_disposition,nature_mutation,valeur_fonciere,adresse_numero,adresse_suffixe,adresse_nom_voie,adresse_code_voie,code_postal,code_commune,nom_commune,code_departement,ancien_code_commune,ancien_nom_commune,id_parcelle,ancien_id_parcelle,numero_volume,lot1_numero,lot1_surface_carrez,lot2_numero,lot2_surface_carrez,lot3_numero,lot3_surface_carrez,lot4_numero,lot4_surface_carrez,lot5_numero,lot5_surface_carrez,nombre_lots,code_type_local,type_local,surface_reelle_bati,nombre_pieces_principales,code_nature_culture,nature_culture,code_nature_culture_speciale,nature_culture_speciale,surface_terrain,longitude,latitude
2023-696245,2023-01-10,000001,Vente,258850,,,LES NEVAUX,B036,54136,54090,Bouxières-aux-Dames,54,,,540900000D1206,,,,,,,,,,,,,0,,,,,T,terres,,,956,6.164851,48.757428
2023-696245,2023-01-10,000001,Vente,258850,,,LES NEVAUX,B036,54136,54090,Bouxières-aux-Dames,54,,,540900000D1208,,,,,,,,,,,,,0,,,,,T,terres,,,9,6.165468,48.757517
2023-696245,2023-01-10,000001,Vente,258850,41,,RUE DE L ABBAYE,0020,54136,54090,Bouxières-aux-Dames,54,,,540900000D1209,,,,,,,,,,,,,0,1,Maison,157,4,S,sols,,,193,6.165526,48.757501
2023-696245,2023-01-10,000001,Vente,258850,41,,RUE DE L ABBAYE,0020,54136,54090,Bouxières-aux-Dames,54,,,540900000D1209,,,,,,,,,,,,,0,3,Dépendance,,0,S,sols,,,193,6.165526,48.757501
2023-696398,2023-01-09,000001,Vente en l'état futur d'achèvement,168200,,,LES NEVAUX,B036,54136,54090,Bouxières-aux-Dames,54,,,540900000D1380,,,5,,,,,,,,,,1,,,,,,,,,,6.162542,48.757447
2023-696398,2023-01-09,000001,Vente en l'état futur d'achèvement,168200,,,LES NEVAUX,B036,54136,54090,Bouxières-aux-Dames,54,,,540900000D1388,,,,,,,,,,,,,0,,,,,AB,terrains a bâtir,,,16,6.162706,48.757538
2023-696398,2023-01-09,000001,Vente en l'état futur d'achèvement,168200,,,LES NEVAUX,B036,54136,54090,Bouxières-aux-Dames,54,,,540900000D1389,,,,,,,,,,,,,0,,,,,AB,terrains a bâtir,,,16,6.162711,48.75749
2023-696497,2023-01-13,000001,Vente,81000,7,,RUE DES CARROSSES,0161,54136,54090,Bouxières-aux-Dames,54,,,540900000D0213,,,,,,,,,,,,,0,3,Dépendance,,0,S,sols,,,845,6.166359,48.757624
2023-696497,2023-01-13,000001,Vente,81000,7,,RUE DES CARROSSES,0161,54136,54090,Bouxières-aux-Dames,54,,,540900000D0213,,,,,,,,,,,,,0,1,Maison,80,5,S,sols,,,845,6.166359,48.757624
2023-697164,2023-01-25,000001,Vente,326450,6,,RUE DU GENERAL LECLERC,0560,54136,54090,Bouxières-aux-Dames,54,,,540900000B0374,,,,,,,,,,,,,0,1,Maison,96,5,S,sols,,,929,6.1694,48.750507
2023-697290,2023-02-01,000001,Vente,175950,,,RUE DES CORVEES,0420,54136,54090,Bouxières-aux-Dames,54,,,540900000A1199,,,,,,,,,,,,,0,,,,,S,sols,,,246,6.167597,48.751036
2023-697319,2023-02-01,000001,Vente,195000,13,,RUE DES CORVEES,0420,54136,54090,Bouxières-aux-Dames,54,,,540900000A1198,,,,,,,,,,,,,0,4,Local industriel. commercial ou assimilé,100,0,S,sols,,,266,6.167654,48.751128
2023-697319,2023-02-01,000001,Vente,195000,13,,RUE DES CORVEES,0420,54136,54090,Bouxières-aux-Dames,54,,,540900000A1198,,,,,,,,,,,,,0,1,Maison,135,5,S,sols,,,266,6.167654,48.751128
2023-697571,2023-01-06,000001,Vente,200000,9,,RUE DU HAUT BOIS,0571,54136,54090,Bouxières-aux-Dames,54,,,540900000F0395,,,,,,,,,,,,,0,1,Maison,93,5,S,sols,,,620,6.16297,48.763875
2023-698066,2023-02-21,000001,Vente,165000,59,,RUE DU TEMERAIRE,0840,54136,54090,Bouxières-aux-Dames,54,,,540900000B0426,,,,,,,,,,,,,0,3,Dépendance,,0,S,sols,,,242,6.172351,48.749472
2023-698066,2023-02-21,000001,Vente,165000,59,,RUE DU TEMERAIRE,0840,54136,54090,Bouxières-aux-Dames,54,,,540900000B0426,,,,,,,,,,,,,0,1,Maison,83,5,S,sols,,,242,6.172351,48.749472
2023-698179,2023-03-03,000001,Vente,180000,67,,RUE RAYMOND POINCARE,0800,54136,54090,Bouxières-aux-Dames,54,,,540900000D0519,,,,,,,,,,,,,0,1,Maison,84,5,S,sols,,,346,6.156029,48.75537
2023-699040,2023-03-06,000001,Vente,54600,1,,RUE DES CORVEES,0420,54136,54090,Bouxières-aux-Dames,54,,,540900000B0017,,,4,21.89,,,,,,,,,1,2,Appartement,22,1,,,,,,6.165449,48.748664
2023-699106,2023-03-16,000002,Vente,240000,3,,AV FOCH,0540,54136,54090,Bouxières-aux-Dames,54,,,540900000B0825,,,,,,,,,,,,,0,3,Dépendance,,0,S,sols,,,557,6.164013,48.749318
2023-699106,2023-03-16,000002,Vente,240000,3,,AV FOCH,0540,54136,54090,Bouxières-aux-Dames,54,,,540900000B0825,,,,,,,,,,,,,0,4,Local industriel. commercial ou assimilé,34,0,S,sols,,,557,6.164013,48.749318
2023-699106,2023-03-16,000002,Vente,240000,3,,AV FOCH,0540,54136,54090,Bouxières-aux-Dames,54,,,540900000B0825,,,,,,,,,,,,,0,2,Appartement,45,2,S,sols,,,557,6.164013,48.749318
2023-699106,2023-03-16,000002,Vente,240000,3,,AV FOCH,0540,54136,54090,Bouxières-aux-Dames,54,,,540900000B0825,,,,,,,,,,,,,0,3,Dépendance,,0,S,sols,,,557,6.164013,48.749318
2023-699106,2023-03-16,000002,Vente,240000,3,,AV FOCH,0540,54136,54090,Bouxières-aux-Dames,54,,,540900000B0825,,,,,,,,,,,,,0,3,Dépendance,,0,S,sols,,,557,6.164013,48.749318
2023-699106,2023-03-16,000002,Vente,240000,3,,AV FOCH,0540,54136,54090,Bouxières-aux-Dames,54,,,540900000B0825,,,,,,,,,,,,,0,3,Dépendance,,0,S,sols,,,557,6.164013,48.749318
2023-699106,2023-03-16,000002,Vente,240000,3,,AV FOCH,0540,54136,54090,Bouxières-aux-Dames,54,,,540900000B0825,,,,,,,,,,,,,0,3,Dépendance,,0,S,sols,,,557,6.164013,48.749318
2023-699106,2023-03-16,000002,Vente,240000,3,,AV FOCH,0540,54136,54090,Bouxières-aux-Dames,54,,,540900000B0825,,,,,,,,,,,,,0,3,Dépendance,,0,S,sols,,,557,6.164013,48.749318
2023-699106,2023-03-16,000002,Vente,240000,3,,AV FOCH,0540,54136,54090,Bouxières-aux-Dames,54,,,540900000B0825,,,,,,,,,,,,,0,3,Dépendance,,0,S,sols,,,557,6.164013,48.749318
2023-699106,2023-03-16,000002,Vente,240000,3,,AV FOCH,0540,54136,54090,Bouxières-aux-Dames,54,,,540900000B0825,,,,,,,,,,,,,0,3,Dépendance,,0,S,sols,,,557,6.164013,48.749318
2023-699106,2023-03-16,000002,Vente,240000,3,,AV FOCH,0540,54136,54090,Bouxières-aux-Dames,54,,,540900000B0825,,,,,,,,,,,,,0,2,Appartement,43,1,S,sols,,,557,6.164013,48.749318
2023-699106,2023-03-16,000002,Vente,240000,3,,AV FOCH,0540,54136,54090,Bouxières-aux-Dames,54,,,540900000B0825,,,,,,,,,,,,,0,2,Appartement,51,1,S,sols,,,557,6.164013,48.749318
2023-699106,2023-03-16,000002,Vente,240000,3,,AV FOCH,0540,54136,54090,Bouxières-aux-Dames,54,,,540900000B0825,,,,,,,,,,,,,0,2,Appartement,72,2,S,sols,,,557,6.164013,48.749318
2023-699249,2023-03-09,000001,Vente,220000,,,LE JEU DE QUILLES,B034,54136,54090,Bouxières-aux-Dames,54,,,540900000B0034,,,,,,,,,,,,,0,,,,,VE,vergers,,,215,6.165929,48.749636
2023-699249,2023-03-09,000001,Vente,220000,,,LE JEU DE QUILLES,B034,54136,54090,Bouxières-aux-Dames,54,,,540900000B0035,,,,,,,,,,,,,0,,,,,VE,vergers,,,110,6.166057,48.749704
2023-699249,2023-03-09,000001,Vente,220000,,,LE JEU DE QUILLES,B034,54136,54090,Bouxières-aux-Dames,54,,,540900000B0036,,,,,,,,,,,,,0,,,,,VE,vergers,,,100,6.16594,48.74955
2023-699249,2023-03-09,000001,Vente,220000,1,B,RUE DES CORVEES,0420,54136,54090,Bouxières-aux-Dames,54,,,540900000B0037,,,,,,,,,,,,,0,1,Maison,75,5,S,sols,,,310,6.16603,48.749486
2023-699570,2023-04-11,000001,Vente,17000,,,LES CHASUPES,B010,54136,54090,Bouxières-aux-Dames,54,,,540900000D0340,,,,,,,,,,,,,0,,,,,VE,vergers,,,480,6.161313,48.755943
2023-699570,2023-04-11,000001,Vente,17000,,,LES CHASUPES,B010,54136,54090,Bouxières-aux-Dames,54,,,540900000D0343,,,,,,,,,,,,,0,,,,,VE,vergers,,,1005,6.16141,48.756052
2023-699776,2023-04-03,000001,Vente,55000,,,LES CHENEVIERES DU PONT,B014,54136,54090,Bouxières-aux-Dames,54,,,540900000B0121,,,,,,,,,,,,,0,,,,,T,terres,,,905,6.164013,48.748582
2023-699906,2023-04-18,000001,Vente,271700,26,,RUE RAYMOND POINCARE,0800,54136,54090,Bouxières-aux-Dames,54,,,540900000A1013,,,,,,,,,,,,,0,1,Maison,86,3,S,sols,,,720,6.159354,48.752045
2023-699906,2023-04-18,000001,Vente,271700,,,BEUVIGNES,B003,54136,54090,Bouxières-aux-Dames,54,,,540900000A1150,,,,,,,,,,,,,0,,,,,T,terres,,,199,6.159582,48.752207
2023-700298,2023-05-02,000001,Vente,246000,,,LES CHARRERES,B008,54136,54090,Bouxières-aux-Dames,54,,,540900000D0646,,,,,,,,,,,,,0,,,,,S,sols,,,133,6.165726,48.756695
2023-700298,2023-05-02,000001,Vente,246000,2,B,RUE DES CARROSSES,0161,54136,54090,Bouxières-aux-Dames,54,,,540900000D0648,,,,,,,,,,,,,0,1,Maison,89,4,S,sols,,,136,6.165861,48.756691
2023-700298,2023-05-02,000001,Vente,246000,,,LES CHARRERES,B008,54136,54090,Bouxières-aux-Dames,54,,,540900000D0650,,,,,,,,,,,,,0,,,,,S,sols,,,248,6.165996,48.756727
2023-700409,2023-04-14,000001,Vente,229000,4,,RUE DES PRES,0790,54136,54090,Bouxières-aux-Dames,54,,,540900000E0170,,,,,,,,,,,,,0,1,Maison,77,4,S,sols,,,261,6.153129,48.759116
2023-700409,2023-04-14,000001,Vente,229000,4,,RUE DES PRES,0790,54136,54090,Bouxières-aux-Dames,54,,,540900000E0170,,,,,,,,,,,,,0,3,Dépendance,,0,S,sols,,,261,6.153129,48.759116
2023-700409,2023-04-14,000001,Vente,229000,4,,RUE DES PRES,0790,54136,54090,Bouxières-aux-Dames,54,,,540900000E0170,,,,,,,,,,,,,0,3,Dépendance,,0,S,sols,,,261,6.153129,48.759116
2023-700556,2023-04-28,000001,Vente,371000,1,,PL DES LONGINES,0615,54136,54090,Bouxières-aux-Dames,54,,,540900000I0369,,,,,,,,,,,,,0,1,Maison,97,4,S,sols,,,784,6.172823,48.751476
2023-700736,2023-05-02,000001,Vente,30000,16,,RUE ALSACE LORRAINE,0040,54136,54090,Bouxières-aux-Dames,54,,,540900000B0535,,,8,,,,,,,,,,1,3,Dépendance,,0,,,,,,6.169636,48.749397
2023-701464,2023-05-04,000001,Vente,15600,,,LE JEU DE QUILLES,B034,54136,54090,Bouxières-aux-Dames,54,,,540900000B0006,,,,,,,,,,,,,0,,,,,J,jardins,,,965,6.164436,48.749519
2023-701464,2023-05-04,000001,Vente,15600,,,LE JEU DE QUILLES,B034,54136,54090,Bouxières-aux-Dames,54,,,540900000B0007,,,,,,,,,,,,,0,,,,,S,sols,,,5,6.164572,48.749596
2023-701464,2023-05-04,000001,Vente,15600,3,,AV FOCH,0540,54136,54090,Bouxières-aux-Dames,54,,,540900000B0826,,,,,,,,,,,,,0,,,,,S,sols,,,348,6.164168,48.749444
2023-701766,2023-06-02,000001,Vente,379000,15,T,RUE DES CLOS,0351,54136,54090,Bouxières-aux-Dames,54,,,540900000A1123,,,,,,,,,,,,,0,1,Maison,160,4,S,sols,,,265,6.16495,48.754475
2023-701766,2023-06-02,000001,Vente,379000,,,CLOS DES MINIMES,B016,54136,54090,Bouxières-aux-Dames,54,,,540900000A1127,,,,,,,,,,,,,0,,,,,S,sols,,,300,6.165271,48.754542
2023-702204,2023-05-23,000001,Vente,3000,,,LES NEVAUX,B036,54136,54090,Bouxières-aux-Dames,54,,,540900000D0168,,,,,,,,,,,,,0,,,,,VE,vergers,,,295,6.164655,48.757295
2023-702284,2023-06-20,000001,Vente,266000,28,,RUE DE LA GOULOTTE,0563,54136,54090,Bouxières-aux-Dames,54,,,540900000F0422,,,,,,,,,,,,,0,1,Maison,102,5,S,sols,,,516,6.162427,48.760651
2023-702338,2023-06-19,000001,Vente,188400,,,PL CLEMENCEAU,0340,54136,54090,Bouxières-aux-Dames,54,,,540900000A0921,,,12,,,,,,,,,,1,,,,,S,sols,,,118,6.162948,48.749305
2023-702338,2023-06-19,000001,Vente,188400,9,,PL CLEMENCEAU,0340,54136,54090,Bouxières-aux-Dames,54,,,540900000A0921,,,2,,6,,,,,,,,2,3,Dépendance,,0,,,,,,6.162948,48.749305
2023-702338,2023-06-19,000001,Vente,188400,9,,PL CLEMENCEAU,0340,54136,54090,Bouxières-aux-Dames,54,,,540900000A0921,,,2,,6,,,,,,,,2,2,Appartement,125,5,,,,,,6.162948,48.749305
2023-702396,2023-06-15,000001,Vente,185250,7,,RUE DU CLOITRE,0350,54136,54090,Bouxières-aux-Dames,54,,,540900000A0515,,,,,,,,,,,,,0,1,Maison,74,4,S,sols,,,80,6.167147,48.754169
2023-702527,2023-06-21,000001,Vente,11000,,,LES COTES,B018,54136,54090,Bouxières-aux-Dames,54,,,540900000I0013,,,,,,,,,,,,,0,,,,,VE,vergers,,,165,6.170942,48.75364
2023-702527,2023-06-21,000001,Vente,11000,,,LES COTES,B018,54136,54090,Bouxières-aux-Dames,54,,,540900000I0014,,,,,,,,,,,,,0,,,,,T,terres,,,845,6.170685,48.753473
2023-702527,2023-06-21,000001,Vente,11000,,,LES COTES,B018,54136,54090,Bouxières-aux-Dames,54,,,540900000I0016,,,,,,,,,,,,,0,,,,,T,terres,,,170,6.170378,48.753372
2023-702558,2023-05-30,000001,Vente,143000,10,,RUE CENDRILLON,0180,54136,54090,Bouxières-aux-Dames,54,,,540900000A0212,,,,,,,,,,,,,0,1,Maison,100,3,S,sols,,,75,6.165689,48.755038
2023-702752,2023-06-08,000001,Vente,98000,8,,RUE ST GAUZELIN,0818,54136,54090,Bouxières-aux-Dames,54,,,540900000A0264,,,,,,,,,,,,,0,1,Maison,70,3,S,sols,,,60,6.166645,48.754369
2023-702752,2023-06-08,000001,Vente,98000,,,BEAUREGARD,B002,54136,54090,Bouxières-aux-Dames,54,,,540900000A0269,,,,,,,,,,,,,0,,,,,J,jardins,,,245,6.166423,48.75417
2023-702917,2023-06-16,000001,Vente,128650,1,,RUE TERRASSE DES NARVANNES,0850,54136,54090,Bouxières-aux-Dames,54,,,540900000E0675,,,,,,,,,,,,,0,3,Dépendance,,0,S,sols,,,8,6.155353,48.760335
2023-702917,2023-06-16,000001,Vente,128650,1,,RUE TERRASSE DES NARVANNES,0850,54136,54090,Bouxières-aux-Dames,54,,,540900000E0686,,,4,,,,,,,,,,1,2,Appartement,46,2,,,,,,6.155657,48.760142
2023-702917,2023-06-16,000001,Vente,128650,,,LES SAUSSOTES,B052,54136,54090,Bouxières-aux-Dames,54,,,540900000E0686,,,19,,,,,,,,,,1,,,,,J,jardins,,,5,6.155657,48.760142
2023-702917,2023-06-16,000001,Vente,128650,,,LES SAUSSOTES,B052,54136,54090,Bouxières-aux-Dames,54,,,540900000E0710,,,,,,,,,,,,,0,,,,,S,sols,,,4,6.155359,48.760342
2023-703107,2023-07-03,000001,Vente,299400,27,,RUE JERICHO,0585,54136,54090,Bouxières-aux-Dames,54,,,540900000F0443,,,,,,,,,,,,,0,1,Maison,111,6,S,sols,,,649,6.163595,48.762435
2023-703159,2023-06-20,000001,Vente,160000,1,,RUE DE LA MINE,0632,54136,54090,Bouxières-aux-Dames,54,,,540900000E0265,,,,,,,,,,,,,0,1,Maison,77,4,S,sols,,,291,6.154252,48.759883
2023-703159,2023-06-20,000001,Vente,160000,9568,,RUE DES NARVANNES,0656,54136,54090,Bouxières-aux-Dames,54,,,540900000E0568,,,,,,,,,,,,,0,3,Dépendance,,0,S,sols,,,15,6.154919,48.760338
2023-703236,2023-07-06,000001,Vente,83000,10,,RUE NEUVE,0660,54136,54090,Bouxières-aux-Dames,54,,,540900000A1071,,,,,,,,,,,,,0,1,Maison,50,1,S,sols,,,32,6.16557,48.755183
2023-703306,2023-07-06,000001,Vente,168700,20,,RUE DE MONTATAIRE,0650,54136,54090,Bouxières-aux-Dames,54,,,540900000E0224,,,,,,,,,,,,,0,1,Maison,93,5,S,sols,,,218,6.155417,48.758846
2023-703306,2023-07-06,000001,Vente,168700,9613,,RUE DE MONTATAIRE,0650,54136,54090,Bouxières-aux-Dames,54,,,540900000E0613,,,,,,,,,,,,,0,3,Dépendance,,0,S,sols,,,15,6.155721,48.758977
2023-703779,2023-07-17,000001,Vente,317100,7,,RUE DE CHIERFONTAINE,0279,54136,54090,Bouxières-aux-Dames,54,,,540900000E0450,,,,,,,,,,,,,0,1,Maison,99,5,S,sols,,,568,6.159669,48.760765
2023-703782,2023-07-20,000001,Vente,20917,,,CHE DE CHIERFONTAINE,0280,54136,54090,Bouxières-aux-Dames,54,,,540900000D1269,,,,,,,,,,,,,0,,,,,VE,vergers,,,280,6.163977,48.7569
2023-703782,2023-07-20,000001,Vente,20917,,,LES NEVAUX,B036,54136,54090,Bouxières-aux-Dames,54,,,540900000D1354,,,,,,,,,,,,,0,,,,,P,prés,,,226,6.164071,48.756811
2023-703782,2023-07-20,000001,Vente,20917,,,LES NEVAUX,B036,54136,54090,Bouxières-aux-Dames,54,,,540900000D1357,,,,,,,,,,,,,0,,,,,VE,vergers,,,308,6.164175,48.756824
2023-703971,2023-07-10,000001,Vente,12334,,,LES CHENEVIERES DU PONT,B014,54136,54090,Bouxières-aux-Dames,54,,,540900000B0824,,,,,,,,,,,,,0,,,,,S,sols,,,196,6.165832,48.748256
2023-704278,2023-07-21,000001,Vente,230000,3,,RUE DE LA SOURCE,0832,54136,54090,Bouxières-aux-Dames,54,,,540900000E0400,,,,,,,,,,,,,0,1,Maison,82,4,S,sols,,,337,6.156668,48.757904
2023-704519,2023-07-24,000001,Vente,159100,9,,RUE DU RUISSEAU,0808,54136,54090,Bouxières-aux-Dames,54,,,540900000E0308,,,,,,,,,,,,,0,1,Maison,82,4,S,sols,,,297,6.156108,48.758029
2023-704708,2023-08-10,000001,Vente,255800,,,LES NEVAUX,B036,54136,54090,Bouxières-aux-Dames,54,,,540900000D0136,,,,,,,,,,,,,0,,,,,T,terres,,,225,6.163459,48.756643
2023-704708,2023-08-10,000001,Vente,255800,,,LES NEVAUX,B036,54136,54090,Bouxières-aux-Dames,54,,,540900000D0694,,,,,,,,,,,,,0,,,,,S,sols,,,386,6.163589,48.756354
2023-704708,2023-08-10,000001,Vente,255800,,,LES NEVAUX,B036,54136,54090,Bouxières-aux-Dames,54,,,540900000D0695,,,,,,,,,,,,,0,,,,,S,sols,,,9,6.16362,48.756094
2023-704708,2023-08-10,000001,Vente,255800,6,,RUE ST ANTOINE,0815,54136,54090,Bouxières-aux-Dames,54,,,540900000D0696,,,,,,,,,,,,,0,1,Maison,100,5,S,sols,,,369,6.16348,48.756349
2023-704708,2023-08-10,000001,Vente,255800,,,LES NEVAUX,B036,54136,54090,Bouxières-aux-Dames,54,,,540900000D0697,,,,,,,,,,,,,0,,,,,S,sols,,,11,6.163511,48.756136
2023-704708,2023-08-10,000001,Vente,255800,,,LES NEVAUX,B036,54136,54090,Bouxières-aux-Dames,54,,,540900000D1147,,,,,,,,,,,,,0,,,,,S,sols,,,76,6.163559,48.756592
2023-705041,2023-08-18,000001,Vente,268700,10,,PL DES CHASUPES,0216,54136,54090,Bouxières-aux-Dames,54,,,540900000F0207,,,,,,,,,,,,,0,1,Maison,95,4,S,sols,,,475,6.163635,48.759768
2023-705252,2023-08-29,000001,Vente,79100,2,,RUE TERRASSE DES NARVANNES,0850,54136,54090,Bouxières-aux-Dames,54,,,540900000E0708,,,,,,,,,,,,,0,3,Dépendance,,0,S,sols,,,12,6.155403,48.760367
2023-705252,2023-08-29,000001,Vente,79100,2,,RUE TERRASSE DES NARVANNES,0850,54136,54090,Bouxières-aux-Dames,54,,,540900000E0733,,,11,31.8,,,,,,,,,1,2,Appartement,31,1,,,,,,6.156003,48.760327
2023-705291,2023-08-04,000001,Vente,169770,13,,RUE DE LA MINE,0632,54136,54090,Bouxières-aux-Dames,54,,,540900000E0259,,,,,,,,,,,,,0,1,Maison,93,5,S,sols,,,240,6.155098,48.759689
2023-705291,2023-08-04,000001,Vente,169770,13,,RUE DE LA MINE,0632,54136,54090,Bouxières-aux-Dames,54,,,540900000E0259,,,,,,,,,,,,,0,3,Dépendance,,0,S,sols,,,240,6.155098,48.759689
2023-705291,2023-08-04,000001,Vente,169770,9592,,RUE DES NARVANNES,0656,54136,54090,Bouxières-aux-Dames,54,,,540900000E0592,,,,,,,,,,,,,0,3,Dépendance,,0,S,sols,,,15,6.156106,48.759706
2023-705415,2023-08-30,000001,Vente,182500,8,,RUE ARSENE GALILE,0060,54136,54090,Bouxières-aux-Dames,54,,,540900000A1201,,,,,,,,,,,,,0,1,Maison,67,3,S,sols,,,609,6.160742,48.75157
2023-705991,2023-09-15,000001,Vente,211000,33,,RUE DES PAQUERETTES,0700,54136,54090,Bouxières-aux-Dames,54,,,540900000B0338,,,,,,,,,,,,,0,1,Maison,90,5,S,sols,,,324,6.168946,48.748441
2023-705991,2023-09-15,000001,Vente,211000,,,LES GRANDES CORVEES,B029,54136,54090,Bouxières-aux-Dames,54,,,540900000B0631,,,,,,,,,,,,,0,,,,,S,sols,,,181,6.169035,48.748667
2023-706031,2023-09-15,000001,Vente,260000,2,,PL DU CHANOIS,0201,54136,54090,Bouxières-aux-Dames,54,,,540900000F0484,,,,,,,,,,,,,0,1,Maison,108,4,S,sols,,,641,6.164374,48.759198
2023-706220,2023-09-05,000001,Vente,157700,4,,RUE DE MONTATAIRE,0650,54136,54090,Bouxières-aux-Dames,54,,,540900000E0232,,,,,,,,,,,,,0,3,Dépendance,,0,S,sols,,,252,6.154269,48.759228
2023-706220,2023-09-05,000001,Vente,157700,4,,RUE DE MONTATAIRE,0650,54136,54090,Bouxières-aux-Dames,54,,,540900000E0232,,,,,,,,,,,,,0,1,Maison,77,4,S,sols,,,252,6.154269,48.759228
2023-706220,2023-09-05,000001,Vente,157700,9526,,RUE DE MONTATAIRE,0650,54136,54090,Bouxières-aux-Dames,54,,,540900000E0526,,,,,,,,,,,,,0,3,Dépendance,,0,S,sols,,,15,6.153972,48.759293
2023-706385,2023-09-14,000001,Vente,233000,6,,RUE DU BOIS DES DAMES,0150,54136,54090,Bouxières-aux-Dames,54,,,540900000A0221,,,,,,,,,,,,,0,1,Maison,98,5,S,sols,,,265,6.16616,48.755971
2023-706546,2023-09-18,000001,Vente,218500,,,DERRIERE CHEZ GEORGIN,B020,54136,54090,Bouxières-aux-Dames,54,,,540900000A1154,,,,,,,,,,,,,0,,,,,S,sols,,,23,6.166372,48.7558
2023-706546,2023-09-18,000001,Vente,218500,,,DERRIERE CHEZ GEORGIN,B020,54136,54090,Bouxières-aux-Dames,54,,,540900000A1156,,,,,,,,,,,,,0,,,,,S,sols,,,52,6.166365,48.755709
2023-706546,2023-09-18,000001,Vente,218500,,,DERRIERE CHEZ GEORGIN,B020,54136,54090,Bouxières-aux-Dames,54,,,540900000A1158,,,,,,,,,,,,,0,,,,,S,sols,,,119,6.166265,48.755619
2023-706546,2023-09-18,000001,Vente,218500,8,,RUE DES CARROSSES,0161,54136,54090,Bouxières-aux-Dames,54,,,540900000A1159,,,,,,,,,,,,,0,1,Maison,133,4,S,sols,,,393,6.166239,48.755553
2023-706822,2023-09-27,000001,Vente,409430,,,BEUVIGNES,B003,54136,54090,Bouxières-aux-Dames,54,,,540900000A0047,,,,,,,,,,,,,0,,,,,T,terres,,,505,6.159879,48.752302
2023-706822,2023-09-27,000001,Vente,409430,11,,RUE DE BEUVIGNES,0140,54136,54090,Bouxières-aux-Dames,54,,,540900000A0056,,,,,,,,,,,,,0,1,Maison,137,4,S,sols,,,680,6.159473,48.752526
2023-706822,2023-09-27,000001,Vente,409430,11,,RUE DE BEUVIGNES,0140,54136,54090,Bouxières-aux-Dames,54,,,540900000A0056,,,,,,,,,,,,,0,3,Dépendance,,0,S,sols,,,680,6.159473,48.752526
2023-706822,2023-09-27,000001,Vente,409430,,,BEUVIGNES,B003,54136,54090,Bouxières-aux-Dames,54,,,540900000A1118,,,,,,,,,,,,,0,,,,,T,terres,,,194,6.159659,48.752274
2023-706899,2023-10-04,000001,Vente,165000,6,B,RUE ST GAUZELIN,0818,54136,54090,Bouxières-aux-Dames,54,,,540900000A0263,,,,,,,,,,,,,0,1,Maison,55,3,S,sols,,,55,6.166664,48.754304
2023-706899,2023-10-04,000001,Vente,165000,,,BEAUREGARD,B002,54136,54090,Bouxières-aux-Dames,54,,,540900000A0270,,,,,,,,,,,,,0,,,,,J,jardins,,,120,6.166541,48.75417
2023-706899,2023-10-04,000001,Vente,165000,,,BEAUREGARD,B002,54136,54090,Bouxières-aux-Dames,54,,,540900000A0272,,,,,,,,,,,,,0,,,,,J,jardins,,,160,6.16653,48.754033
2023-707092,2023-09-13,000001,Vente,52000,,,RUE ARSENE GALILE,0060,54136,54090,Bouxières-aux-Dames,54,,,540900000A1202,,,,,,,,,,,,,0,,,,,S,sols,,,183,6.160492,48.751495
2023-708062,2023-11-07,000001,Vente,410000,19,,RUE DU GENERAL LECLERC,0560,54136,54090,Bouxières-aux-Dames,54,,,540900000A0296,,,,,,,,,,,,,0,1,Maison,187,8,S,sols,,,1095,6.167959,48.751479
2023-708062,2023-11-07,000001,Vente,410000,,,RUE DU COMTE DE FRAWENBERG,0400,54136,54090,Bouxières-aux-Dames,54,,,540900000A0297,,,,,,,,,,,,,0,,,,,S,sols,,,350,6.167807,48.75132
2023-708307,2023-11-02,000001,Vente,760000,6,,RUE CHARLES BOURSEUL,0210,54136,54090,Bouxières-aux-Dames,54,,,540900000C0853,,,,,,,,,,,,,0,4,Local industriel. commercial ou assimilé,391,0,S,sols,,,1385,6.15194,48.758542
2023-708307,2023-11-02,000001,Vente,760000,,,DERRIERE LES CRASSES,B021,54136,54090,Bouxières-aux-Dames,54,,,540900000C0855,,,,,,,,,,,,,0,,,,,S,sols,,,356,6.15185,48.758333
2023-708819,2023-11-27,000001,Vente,113500,14,,RUE DU MARECHAL LYAUTEY,0620,54136,54090,Bouxières-aux-Dames,54,,,540900000B0351,,,,,,,,,,,,,0,1,Maison,66,4,S,sols,,,397,6.169541,48.749707
2023-709280,2023-11-15,000001,Vente,131900,1,,RUE TERRASSE DES NARVANNES,0850,54136,54090,Bouxières-aux-Dames,54,,,540900000E0683,,,,,,,,,,,,,0,3,Dépendance,,0,S,sols,,,12,6.155443,48.760239
2023-709280,2023-11-15,000001,Vente,131900,1,,RUE TERRASSE DES NARVANNES,0850,54136,54090,Bouxières-aux-Dames,54,,,540900000E0686,,,1,,,,,,,,,,1,2,Appartement,46,2,,,,,,6.155657,48.760142
2023-709280,2023-11-15,000001,Vente,131900,,,LES SAUSSOTES,B052,54136,54090,Bouxières-aux-Dames,54,,,540900000E0686,,,16,,,,,,,,,,1,,,,,J,jardins,,,5,6.155657,48.760142
2023-709280,2023-11-15,000001,Vente,131900,1,,RUE TERRASSE DES NARVANNES,0850,54136,54090,Bouxières-aux-Dames,54,,,540900000E0686,,,1,,,,,,,,,,1,3,Dépendance,,0,,,,,,6.155657,48.760142
2023-709651,2023-12-05,000001,Vente,1091595,,,PRE GRIEYR,B045,54136,54090,Bouxières-aux-Dames,54,,,540900000C0510,,,,,,,,,,,,,0,,,,,L,landes,FRICH,Friche,1378,6.154425,48.746811
2023-709726,2023-11-30,000001,Vente,256820,,,PRE DES VACHES,B044,54136,54090,Bouxières-aux-Dames,54,,,540900000C0927,,,,,,,,,,,,,0,,,,,S,sols,,,1367,6.154681,48.756275
2023-709726,2023-11-30,000001,Vente,256820,79,B,RUE RAYMOND POINCARE,0800,54136,54090,Bouxières-aux-Dames,54,,,540900000D1166,,,,,,,,,,,,,0,1,Maison,148,5,S,sols,,,555,6.155331,48.756444
2023-710068,2023-12-21,000001,Vente,15000,,,LES CHARRERES,B008,54136,54090,Bouxières-aux-Dames,54,,,540900000D1443,,,,,,,,,,,,,0,,,,,VE,vergers,,,183,6.165371,48.755905
2023-710077,2023-11-20,000001,Vente,290000,,,BEUVIGNES,B003,54136,54090,Bouxières-aux-Dames,54,,,540900000A0994,,,,,,,,,,,,,0,,,,,VI,vignes,,,255,6.159405,48.752285
2023-710077,2023-11-20,000001,Vente,290000,13,,RUE DE BEUVIGNES,0140,54136,54090,Bouxières-aux-Dames,54,,,540900000A1189,,,,,,,,,,,,,0,1,Maison,138,5,S,sols,,,600,6.159284,48.752432
2023-710082,2023-12-21,000001,Vente,15000,,,LES CHARRERES,B008,54136,54090,Bouxières-aux-Dames,54,,,540900000D1442,,,,,,,,,,,,,0,,,,,VE,vergers,,,183,6.165513,48.756137
