id_mutation,date_mutation,numero_disposition,nature_mutation,valeur_fonciere,adresse_numero,adresse_suffixe,adresse_nom_voie,adresse_code_voie,code_postal,code_commune,nom_commune,code_departement,ancien_code_commune,ancien_nom_commune,id_parcelle,ancien_id_parcelle,numero_volume,lot1_numero,lot1_surface_carrez,lot2_numero,lot2_surface_carrez,lot3_numero,lot3_surface_carrez,lot4_numero,lot4_surface_carrez,lot5_numero,lot5_surface_carrez,nombre_lots,code_type_local,type_local,surface_reelle_bati,nombre_pieces_principales,code_nature_culture,nature_culture,code_nature_culture_speciale,nature_culture_speciale,surface_terrain,longitude,latitude
2023-696386,2023-01-03,000001,Vente,13000,28,,GRANDE RUE,0040,54450,54211,Frémonville,54,,,54211000ZC0020,,,,,,,,,,,,,0,1,Maison,115,3,J,jardins,,,475,6.886865,48.595997
2023-696386,2023-01-03,000001,Vente,13000,28,,GRANDE RUE,0040,54450,54211,Frémonville,54,,,54211000ZC0020,,,,,,,,,,,,,0,1,Maison,115,3,S,sols,,,275,6.886865,48.595997
2023-698170,2023-02-20,000001,Vente,2000,,,LE HAUT DE TRAITS,B045,54450,54211,Frémonville,54,,,54211000ZA0171,,,,,,,,,,,,,0,,,,,P,prés,,,3926,6.880051,48.594368
2023-698524,2023-03-08,000001,Vente,160000,3,,RUE DE GOGNEY,0035,54450,54211,Frémonville,54,,,54211000ZC0064,,,,,,,,,,,,,0,1,Maison,140,5,J,jardins,,,1485,6.89148,48.597057
2023-698524,2023-03-08,000001,Vente,160000,3,,RUE DE GOGNEY,0035,54450,54211,Frémonville,54,,,54211000ZC0064,,,,,,,,,,,,,0,1,Maison,140,5,S,sols,,,811,6.89148,48.597057
2023-698524,2023-03-08,000001,Vente,160000,,,LE VILLAGE,B079,54450,54211,Frémonville,54,,,54211000ZC0065,,,,,,,,,,,,,0,,,,,P,prés,,,600,6.892434,48.597517
2023-698939,2023-03-10,000001,Vente,1884,,,LE VILLAGE,B079,54450,54211,Frémonville,54,,,54211000ZC0301,,,,,,,,,,,,,0,,,,,S,sols,,,157,6.887967,48.595648
2023-698948,2023-03-10,000001,Vente,1044,,,LE VILLAGE,B079,54450,54211,Frémonville,54,,,54211000ZC0300,,,,,,,,,,,,,0,,,,,S,sols,,,87,6.887788,48.595685
2023-698954,2023-03-10,000001,Vente,2220,,,LE VILLAGE,B079,54450,54211,Frémonville,54,,,54211000ZC0302,,,,,,,,,,,,,0,,,,,S,sols,,,185,6.887986,48.595508
2023-702871,2023-06-15,000001,Vente,169900,1,,RUE DU FAUBOURG,0020,54450,54211,Frémonville,54,,,54211000ZC0144,,,,,,,,,,,,,0,1,Maison,140,5,S,sols,,,603,6.891469,48.595934
2023-706049,2023-08-29,000001,Vente,60000,2,,RUE DES ECOLES,0015,54450,54211,Frémonville,54,,,54211000ZC0158,,,,,,,,,,,,,0,1,Maison,102,4,S,sols,,,422,6.890705,48.596236
2023-707404,2023-09-26,000001,Vente,13000,,,LE VILLAGE,B079,54450,54211,Frémonville,54,,,54211000ZC0200,,,,,,,,,,,,,0,,,,,S,sols,,,203,6.888153,48.595515
2023-707404,2023-09-26,000001,Vente,13000,,,LE VILLAGE,B079,54450,54211,Frémonville,54,,,54211000ZC0201,,,,,,,,,,,,,0,,,,,S,sols,,,203,6.888209,48.595548
2023-707404,2023-09-26,000001,Vente,13000,,,LE VILLAGE,B079,54450,54211,Frémonville,54,,,54211000ZC0202,,,,,,,,,,,,,0,,,,,S,sols,,,90,6.888241,48.595594
2023-707404,2023-09-26,000001,Vente,13000,,,LE VILLAGE,B079,54450,54211,Frémonville,54,,,54211000ZC0203,,,,,,,,,,,,,0,,,,,S,sols,,,90,6.888262,48.595619
2023-707590,2023-09-26,000001,Vente,200,,,HAUT DE TRAITS,B044,54450,54211,Frémonville,54,,,54211000AE0399,,,,,,,,,,,,,0,,,,,P,prés,,,192,6.883042,48.593703
2023-709731,2023-11-29,000001,Vente,18817,,,LA GRANDE VOILE,B042,54450,54211,Frémonville,54,,,54211000AB0049,,,,,,,,,,,,,0,,,,,BT,taillis simples,,,3350,6.920503,48.632415
2023-709731,2023-11-29,000001,Vente,18817,,,LA GRANDE VOILE,B042,54450,54211,Frémonville,54,,,54211000AB0050,,,,,,,,,,,,,0,,,,,P,prés,,,40330,6.920844,48.633816
2023-710490,2023-12-22,000001,Vente,100000,,,LE VILLAGE,B079,54450,54211,Frémonville,54,,,54211000ZC0237,,,,,,,,,,,,,0,,,,,S,sols,,,18,6.886303,48.594968
2023-710490,2023-12-22,000001,Vente,100000,3,,GRANDE RUE,0040,54450,54211,Frémonville,54,,,54211000ZC0271,,,,,,,,,,,,,0,1,Maison,110,6,VE,vergers,,,620,6.886062,48.594808
2023-710490,2023-12-22,000001,Vente,100000,3,,GRANDE RUE,0040,54450,54211,Frémonville,54,,,54211000ZC0271,,,,,,,,,,,,,0,1,Maison,110,6,S,sols,,,1263,6.886062,48.594808
2023-710490,2023-12-22,000001,Vente,100000,3,,GRANDE RUE,0040,54450,54211,Frémonville,54,,,54211000ZC0271,,,,,,,,,,,,,0,1,Maison,110,6,P,prés,,,2653,6.886062,48.594808
2023-710490,2023-12-22,000001,Vente,100000,3,,GRANDE RUE,0040,54450,54211,Frémonville,54,,,54211000ZC0271,,,,,,,,,,,,,0,1,Maison,110,6,J,jardins,,,665,6.886062,48.594808
