id_mutation,date_mutation,numero_disposition,nature_mutation,valeur_fonciere,adresse_numero,adresse_suffixe,adresse_nom_voie,adresse_code_voie,code_postal,code_commune,nom_commune,code_departement,ancien_code_commune,ancien_nom_commune,id_parcelle,ancien_id_parcelle,numero_volume,lot1_numero,lot1_surface_carrez,lot2_numero,lot2_surface_carrez,lot3_numero,lot3_surface_carrez,lot4_numero,lot4_surface_carrez,lot5_numero,lot5_surface_carrez,nombre_lots,code_type_local,type_local,surface_reelle_bati,nombre_pieces_principales,code_nature_culture,nature_culture,code_nature_culture_speciale,nature_culture_speciale,surface_terrain,longitude,latitude
2023-696480,2023-01-18,000001,Vente,1500,,,LE PATURAL,B068,54470,54518,Thiaucourt-Regniéville,54,,,545180000C0018,,,,,,,,,,,,,0,,,,,T,terres,,,1505,5.868385,48.959062
2023-696480,2023-01-18,000001,Vente,1500,,,LE PATURAL,B068,54470,54518,Thiaucourt-Regniéville,54,,,545180000C0021,,,,,,,,,,,,,0,,,,,T,terres,,,965,5.868795,48.958373
2023-696924,2023-02-01,000001,Vente,600,,,LES PETITES COTES,B071,54470,54518,Thiaucourt-Regniéville,54,,,54518000ZN0062,,,,,,,,,,,,,0,,,,,T,terres,,,2496,5.870857,48.945342
2023-697352,2023-02-10,000001,Vente,35000,2,,RUE COUPE D OR,0160,54470,54518,Thiaucourt-Regniéville,54,,,54518000AK0432,,,,,,,,,,,,,0,3,Dépendance,,0,S,sols,,,399,5.865271,48.952575
2023-697352,2023-02-10,000001,Vente,35000,2,,RUE COUPE D OR,0160,54470,54518,Thiaucourt-Regniéville,54,,,54518000AK0432,,,,,,,,,,,,,0,3,Dépendance,,0,S,sols,,,399,5.865271,48.952575
2023-697352,2023-02-10,000001,Vente,35000,2,,RUE COUPE D OR,0160,54470,54518,Thiaucourt-Regniéville,54,,,54518000AK0432,,,,,,,,,,,,,0,3,Dépendance,,0,S,sols,,,399,5.865271,48.952575
2023-697352,2023-02-10,000001,Vente,35000,2,,RUE COUPE D OR,0160,54470,54518,Thiaucourt-Regniéville,54,,,54518000AK0432,,,,,,,,,,,,,0,1,Maison,114,6,S,sols,,,399,5.865271,48.952575
2023-697426,2023-02-02,000001,Vente,1000,5194,F,LA VILLE OUEST,B108,54470,54518,Thiaucourt-Regniéville,54,,,54518000AK0194,,,,,,,,,,,,,0,4,Local industriel. commercial ou assimilé,,0,BT,taillis simples,,,1295,5.863928,48.951825
2023-697450,2023-02-13,000001,Vente,8000,,,RUE DES PROMENADES,0480,54470,54518,Thiaucourt-Regniéville,54,,,54518000AL0434,,,,,,,,,,,,,0,,,,,S,sols,,,321,5.867647,48.953829
2023-697548,2023-01-27,000001,Vente,54000,46,,RUE CARNOT,0080,54470,54518,Thiaucourt-Regniéville,54,,,54518000AK0347,,,1,,10,119,11,,12,,2,119.24,6,3,Dépendance,,0,,,,,,5.86521,48.954755
2023-697548,2023-01-27,000001,Vente,54000,,,RUE CARNOT,0080,54470,54518,Thiaucourt-Regniéville,54,,,54518000AK0347,,,5,,,,,,,,,,1,,,,,S,sols,,,9,5.86521,48.954755
2023-697548,2023-01-27,000001,Vente,54000,46,,RUE CARNOT,0080,54470,54518,Thiaucourt-Regniéville,54,,,54518000AK0347,,,1,,10,119,11,,12,,2,119.24,6,2,Appartement,113,3,,,,,,5.86521,48.954755
2023-697548,2023-01-27,000001,Vente,54000,46,,RUE CARNOT,0080,54470,54518,Thiaucourt-Regniéville,54,,,54518000AK0347,,,1,,10,119,11,,12,,2,119.24,6,3,Dépendance,,0,,,,,,5.86521,48.954755
2023-697548,2023-01-27,000001,Vente,54000,46,,RUE CARNOT,0080,54470,54518,Thiaucourt-Regniéville,54,,,54518000AK0347,,,1,,10,119,11,,12,,2,119.24,6,3,Dépendance,,0,,,,,,5.86521,48.954755
2023-697604,2023-02-16,000001,Vente,8500,,,LA VILLE EST,B107,54470,54518,Thiaucourt-Regniéville,54,,,54518000AL0100,,,,,,,,,,,,,0,,,,,T,terres,,,400,5.867246,48.953809
2023-697947,2023-02-27,000001,Vente,156750,10,,RUE DU FAUBOURG SAINT JEAN,0220,54470,54518,Thiaucourt-Regniéville,54,,,54518000AL0182,,,,,,,,,,,,,0,1,Maison,84,3,S,sols,,,180,5.867028,48.951356
2023-697947,2023-02-27,000001,Vente,156750,9009,,RUE DU FAUBOURG SAINT JEAN,0220,54470,54518,Thiaucourt-Regniéville,54,,,54518000AL0264,,,,,,,,,,,,,0,3,Dépendance,,0,S,sols,,,239,5.867144,48.951387
2023-697969,2023-02-23,000001,Vente,13000,,,RUE MANGIN,0340,54470,54518,Thiaucourt-Regniéville,54,,,54518000AK0414,,,,,,,,,,,,,0,,,,,S,sols,,,86,5.86455,48.953216
2023-698130,2023-03-03,000001,Vente,10000,10,,RUE CARNOT,0080,54470,54518,Thiaucourt-Regniéville,54,,,54518000AL0165,,,,,,,,,,,,,0,1,Maison,65,4,S,sols,,,73,5.865777,48.95287
2023-698130,2023-03-03,000001,Vente,10000,,,LA VIGNOTTE,B106,54470,54518,Thiaucourt-Regniéville,54,,,545180000F0434,,,,,,,,,,,,,0,,,,,T,terres,,,20,5.864134,48.951262
2023-698266,2023-03-09,000001,Vente,3000,9003,,RUE DES PROMENADES,0480,54470,54518,Thiaucourt-Regniéville,54,,,54518000AK0278,,,,,,,,,,,,,0,3,Dépendance,,0,S,sols,,,133,5.86466,48.952306
2023-698774,2023-03-23,000001,Vente,26000,9002,,LA COTE DES CHEVRES,B028,54470,54518,Thiaucourt-Regniéville,54,,,54518000ZI0077,,,,,,,,,,,,,0,3,Dépendance,,0,VE,vergers,,,6200,5.870578,48.953655
2023-698774,2023-03-23,000001,Vente,26000,9002,,LA COTE DES CHEVRES,B028,54470,54518,Thiaucourt-Regniéville,54,,,54518000ZI0077,,,,,,,,,,,,,0,3,Dépendance,,0,T,terres,,,7899,5.870578,48.953655
2023-698774,2023-03-23,000001,Vente,26000,9002,,LA COTE DES CHEVRES,B028,54470,54518,Thiaucourt-Regniéville,54,,,54518000ZI0077,,,,,,,,,,,,,0,3,Dépendance,,0,BT,taillis simples,,,3000,5.870578,48.953655
2023-698774,2023-03-23,000001,Vente,26000,9002,,LA COTE DES CHEVRES,B028,54470,54518,Thiaucourt-Regniéville,54,,,54518000ZI0077,,,,,,,,,,,,,0,3,Dépendance,,0,BR,futaies résineuses,,,3100,5.870578,48.953655
2023-698774,2023-03-23,000001,Vente,26000,9002,,LA COTE DES CHEVRES,B028,54470,54518,Thiaucourt-Regniéville,54,,,54518000ZI0077,,,,,,,,,,,,,0,3,Dépendance,,0,S,sols,,,500,5.870578,48.953655
2023-700304,2023-04-17,000001,Vente,183645,14,,RUE CARNOT,0080,54470,54518,Thiaucourt-Regniéville,54,,,54518000AL0148,,,1,,,,,,,,,,1,3,Dépendance,,0,,,,,,5.866028,48.953153
2023-700304,2023-04-17,000001,Vente,183645,14,,RUE CARNOT,0080,54470,54518,Thiaucourt-Regniéville,54,,,54518000AL0148,,,2,,,,,,,,,,1,2,Appartement,60,3,,,,,,5.866028,48.953153
2023-700304,2023-04-17,000001,Vente,183645,14,,RUE CARNOT,0080,54470,54518,Thiaucourt-Regniéville,54,,,54518000AL0148,,,2,,,,,,,,,,1,3,Dépendance,,0,,,,,,5.866028,48.953153
2023-700304,2023-04-17,000001,Vente,183645,14,,RUE CARNOT,0080,54470,54518,Thiaucourt-Regniéville,54,,,54518000AL0148,,,2,,,,,,,,,,1,2,Appartement,110,5,,,,,,5.866028,48.953153
2023-700304,2023-04-17,000001,Vente,183645,14,,RUE CARNOT,0080,54470,54518,Thiaucourt-Regniéville,54,,,54518000AL0148,,,2,,,,,,,,,,1,2,Appartement,40,2,,,,,,5.866028,48.953153
2023-700471,2023-04-27,000001,Vente,305000,1,,RUE DU CHANOINE MARANGE,0101,54470,54518,Thiaucourt-Regniéville,54,,,54518000AK0436,,,,,,,,,,,,,0,1,Maison,250,7,S,sols,,,948,5.865132,48.955324
2023-700471,2023-04-27,000001,Vente,305000,1,,RUE DU CHANOINE MARANGE,0101,54470,54518,Thiaucourt-Regniéville,54,,,54518000AK0436,,,,,,,,,,,,,0,1,Maison,250,7,J,jardins,,,691,5.865132,48.955324
2023-700668,2023-05-02,000002,Vente,490000,3,,RUE MANGIN,0340,54470,54518,Thiaucourt-Regniéville,54,,,54518000AK0162,,,,,,,,,,,,,0,3,Dépendance,,0,S,sols,,,590,5.865097,48.95338
2023-700877,2023-05-10,000001,Vente,43500,,,LES PETITES COTES,B071,54470,54518,Thiaucourt-Regniéville,54,,,545180000F0637,,,,,,,,,,,,,0,,,,,AB,terrains a bâtir,,,797,5.87288,48.947337
2023-701291,2023-05-23,000001,Vente,36000,9,,RUE BREHART,0060,54470,54518,Thiaucourt-Regniéville,54,,,54518000AL0088,,,1,65.85,,,,,,,,,1,2,Appartement,80,2,,,,,,5.866582,48.954109
2023-701535,2023-05-23,000001,Vente,250000,9000,,AU CIMETIERE ALLEMAND,B024,54470,54518,Thiaucourt-Regniéville,54,,,545180000F0605,,,,,,,,,,,,,0,4,Local industriel. commercial ou assimilé,397,0,S,sols,,,2769,5.879577,48.944872
2023-701535,2023-05-23,000001,Vente,250000,,,AU CIMETIERE ALLEMAND,B024,54470,54518,Thiaucourt-Regniéville,54,,,545180000F0620,,,,,,,,,,,,,0,,,,,S,sols,,,519,5.87916,48.944641
2023-701639,2023-05-24,000001,Vente,100000,1,,RUE DE JAULNY,0280,54470,54518,Thiaucourt-Regniéville,54,,,54518000AK0067,,,2,,,,,,,,,,1,2,Appartement,110,3,,,,,,5.863944,48.955456
2023-701639,2023-05-24,000001,Vente,100000,1,,RUE DE JAULNY,0280,54470,54518,Thiaucourt-Regniéville,54,,,54518000AK0067,,,3,,,,,,,,,,1,3,Dépendance,,0,,,,,,5.863944,48.955456
2023-701639,2023-05-24,000001,Vente,100000,1,,RUE DE JAULNY,0280,54470,54518,Thiaucourt-Regniéville,54,,,54518000AK0067,,,3,,,,,,,,,,1,3,Dépendance,,0,,,,,,5.863944,48.955456
2023-701639,2023-05-24,000001,Vente,100000,1,,RUE DE JAULNY,0280,54470,54518,Thiaucourt-Regniéville,54,,,54518000AK0067,,,1,,,,,,,,,,1,2,Appartement,108,3,,,,,,5.863944,48.955456
2023-701639,2023-05-24,000001,Vente,100000,,,LA VILLE OUEST,B108,54470,54518,Thiaucourt-Regniéville,54,,,54518000AK0430,,,,,,,,,,,,,0,,,,,S,sols,,,550,5.864094,48.955365
2023-702050,2023-06-14,000001,Vente,41000,8,,RUE NEUVE,0420,54470,54518,Thiaucourt-Regniéville,54,,,54518000AL0174,,,,,,,,,,,,,0,1,Maison,75,5,S,sols,,,84,5.866403,48.952603
2023-702817,2023-07-03,000001,Vente,17054,,,LA COTE DES CHEVRES,B028,54470,54518,Thiaucourt-Regniéville,54,,,54518000ZI0080,,,,,,,,,,,,,0,,,,,T,terres,,,1800,5.872694,48.953598
2023-702817,2023-07-03,000001,Vente,17054,,,LA COTE DES CHEVRES,B028,54470,54518,Thiaucourt-Regniéville,54,,,54518000ZI0080,,,,,,,,,,,,,0,,,,,VI,vignes,,,8100,5.872694,48.953598
2023-702817,2023-07-03,000001,Vente,17054,,,LA COTE DES CHEVRES,B028,54470,54518,Thiaucourt-Regniéville,54,,,54518000ZI0080,,,,,,,,,,,,,0,,,,,T,terres,,,15719,5.872694,48.953598
2023-703529,2023-07-06,000001,Vente,162000,5,,RUE DU GEN DE GAULLE,0244,54470,54518,Thiaucourt-Regniéville,54,,,545180000F0412,,,,,,,,,,,,,0,3,Dépendance,,0,S,sols,,,588,5.871127,48.948348
2023-703529,2023-07-06,000001,Vente,162000,5,,RUE DU GEN DE GAULLE,0244,54470,54518,Thiaucourt-Regniéville,54,,,545180000F0412,,,,,,,,,,,,,0,1,Maison,88,5,S,sols,,,588,5.871127,48.948348
2023-703529,2023-07-06,000001,Vente,162000,,,LES PETITES COTES,B071,54470,54518,Thiaucourt-Regniéville,54,,,545180000F0497,,,,,,,,,,,,,0,,,,,T,terres,,,500,5.871054,48.948599
2023-703920,2023-07-20,000001,Vente,158000,9,,RUE CARNOT,0080,54470,54518,Thiaucourt-Regniéville,54,,,54518000AK0156,,,,,,,,,,,,,0,1,Maison,100,3,S,sols,,,86,5.865466,48.953232
2023-704892,2023-08-11,000001,Vente,137750,13,B,RUE CARNOT,0080,54470,54518,Thiaucourt-Regniéville,54,,,54518000AK0279,,,,,,,,,,,,,0,2,Appartement,75,3,S,sols,,,107,5.865251,48.953343
2023-704892,2023-08-11,000001,Vente,137750,13,B,RUE CARNOT,0080,54470,54518,Thiaucourt-Regniéville,54,,,54518000AK0279,,,,,,,,,,,,,0,2,Appartement,45,2,S,sols,,,107,5.865251,48.953343
2023-704892,2023-08-11,000001,Vente,137750,13,B,RUE CARNOT,0080,54470,54518,Thiaucourt-Regniéville,54,,,54518000AK0279,,,,,,,,,,,,,0,3,Dépendance,,0,S,sols,,,107,5.865251,48.953343
2023-704892,2023-08-11,000001,Vente,137750,13,B,RUE CARNOT,0080,54470,54518,Thiaucourt-Regniéville,54,,,54518000AK0279,,,,,,,,,,,,,0,3,Dépendance,,0,S,sols,,,107,5.865251,48.953343
2023-704892,2023-08-11,000001,Vente,137750,13,B,RUE CARNOT,0080,54470,54518,Thiaucourt-Regniéville,54,,,54518000AK0279,,,,,,,,,,,,,0,3,Dépendance,,0,S,sols,,,107,5.865251,48.953343
2023-704892,2023-08-11,000001,Vente,137750,,,LA VILLE OUEST,B108,54470,54518,Thiaucourt-Regniéville,54,,,54518000AK0280,,,,,,,,,,,,,0,,,,,S,sols,,,223,5.865137,48.95323
2023-705233,2023-08-10,000001,Vente,63500,9105,,RUE DE LA VIEILLE HALLE,0540,54470,54518,Thiaucourt-Regniéville,54,,,54518000AL0325,,,,,,,,,,,,,0,2,Appartement,78,2,S,sols,,,84,5.866396,48.954493
2023-705233,2023-08-10,000001,Vente,63500,9105,,RUE DE LA VIEILLE HALLE,0540,54470,54518,Thiaucourt-Regniéville,54,,,54518000AL0325,,,,,,,,,,,,,0,3,Dépendance,,0,S,sols,,,84,5.866396,48.954493
2023-705233,2023-08-10,000001,Vente,63500,9105,,RUE DE LA VIEILLE HALLE,0540,54470,54518,Thiaucourt-Regniéville,54,,,54518000AL0325,,,,,,,,,,,,,0,3,Dépendance,,0,S,sols,,,84,5.866396,48.954493
2023-705233,2023-08-10,000001,Vente,63500,9105,,RUE DE LA VIEILLE HALLE,0540,54470,54518,Thiaucourt-Regniéville,54,,,54518000AL0325,,,,,,,,,,,,,0,3,Dépendance,,0,S,sols,,,84,5.866396,48.954493
2023-705645,2023-09-06,000001,Vente,113500,5,,RUE COUPE D OR,0160,54470,54518,Thiaucourt-Regniéville,54,,,54518000AK0177,,,,,,,,,,,,,0,1,Maison,200,5,S,sols,,,495,5.864601,48.952861
2023-705758,2023-09-05,000001,Vente,64000,24,,RUE DE VERDUN,0520,54470,54518,Thiaucourt-Regniéville,54,,,54518000AK0099,,,,,,,,,,,,,0,1,Maison,60,3,S,sols,,,150,5.858478,48.956367
2023-705758,2023-09-05,000001,Vente,64000,24,,RUE DE VERDUN,0520,54470,54518,Thiaucourt-Regniéville,54,,,54518000AK0099,,,,,,,,,,,,,0,1,Maison,60,3,P,prés,,,3785,5.858478,48.956367
2023-705971,2023-09-13,000002,Vente,1000,,,FAUBOURG SAINT JEAN,B038,54470,54518,Thiaucourt-Regniéville,54,,,54518000AL0436,,,,,,,,,,,,,0,,,,,VE,vergers,,,335,5.870052,48.951257
2023-706052,2023-09-14,000001,Vente,155000,1,,RUE DE LA VIEILLE HALLE,0540,54470,54518,Thiaucourt-Regniéville,54,,,54518000AL0089,,,,,,,,,,,,,0,2,Appartement,35,1,S,sols,,,150,5.866694,48.954267
2023-706052,2023-09-14,000001,Vente,155000,1,,RUE DE LA VIEILLE HALLE,0540,54470,54518,Thiaucourt-Regniéville,54,,,54518000AL0089,,,,,,,,,,,,,0,2,Appartement,35,1,S,sols,,,150,5.866694,48.954267
2023-706052,2023-09-14,000001,Vente,155000,1,,RUE DE LA VIEILLE HALLE,0540,54470,54518,Thiaucourt-Regniéville,54,,,54518000AL0089,,,,,,,,,,,,,0,2,Appartement,80,3,S,sols,,,150,5.866694,48.954267
2023-706052,2023-09-14,000001,Vente,155000,1,,RUE DE LA VIEILLE HALLE,0540,54470,54518,Thiaucourt-Regniéville,54,,,54518000AL0089,,,,,,,,,,,,,0,2,Appartement,80,3,S,sols,,,150,5.866694,48.954267
2023-706052,2023-09-14,000001,Vente,155000,1,,RUE DE LA VIEILLE HALLE,0540,54470,54518,Thiaucourt-Regniéville,54,,,54518000AL0089,,,,,,,,,,,,,0,2,Appartement,70,3,S,sols,,,150,5.866694,48.954267
2023-706289,2023-09-20,000001,Vente,2500,,,PLAT DE CAURE,B075,54470,54518,Thiaucourt-Regniéville,54,,,54518000ZN0039,,,,,,,,,,,,,0,,,,,T,terres,,,2448,5.864269,48.949477
2023-706289,2023-09-20,000001,Vente,2500,,,PLAT DE CAURE,B075,54470,54518,Thiaucourt-Regniéville,54,,,54518000ZN0040,,,,,,,,,,,,,0,,,,,T,terres,,,2301,5.864114,48.949256
2023-706567,2023-09-29,000002,Vente,25000,7,,RUE MARIE WUARA,0360,54470,54518,Thiaucourt-Regniéville,54,,,54518000AK0435,,,,,,,,,,,,,0,,,,,S,sols,,,80,5.86478,48.953795
2023-706999,2023-10-10,000001,Vente,126000,1,,RTE DE PRENY,0462,54470,54518,Thiaucourt-Regniéville,54,,,54518000ZI0074,,,,,,,,,,,,,0,1,Maison,86,3,S,sols,,,665,5.86919,48.952897
2023-707520,2023-10-20,000001,Vente,290000,1,,CHE LA FONTAINE AUX CAPUCINS,0212,54470,54518,Thiaucourt-Regniéville,54,,,545180000A0044,,,,,,,,,,,,,0,3,Dépendance,,0,AG,terrains d'agrément,,,2070,5.857021,48.954528
2023-707520,2023-10-20,000001,Vente,290000,1,,CHE LA FONTAINE AUX CAPUCINS,0212,54470,54518,Thiaucourt-Regniéville,54,,,545180000A0044,,,,,,,,,,,,,0,1,Maison,192,5,BT,taillis simples,,,4141,5.857021,48.954528
2023-707520,2023-10-20,000001,Vente,290000,1,,CHE LA FONTAINE AUX CAPUCINS,0212,54470,54518,Thiaucourt-Regniéville,54,,,545180000A0044,,,,,,,,,,,,,0,1,Maison,192,5,AG,terrains d'agrément,,,2070,5.857021,48.954528
2023-707520,2023-10-20,000001,Vente,290000,1,,CHE LA FONTAINE AUX CAPUCINS,0212,54470,54518,Thiaucourt-Regniéville,54,,,545180000A0044,,,,,,,,,,,,,0,3,Dépendance,,0,BT,taillis simples,,,4141,5.857021,48.954528
2023-707520,2023-10-20,000001,Vente,290000,1,,CHE LA FONTAINE AUX CAPUCINS,0212,54470,54518,Thiaucourt-Regniéville,54,,,545180000A0044,,,,,,,,,,,,,0,1,Maison,192,5,S,sols,,,699,5.857021,48.954528
2023-707520,2023-10-20,000001,Vente,290000,1,,CHE LA FONTAINE AUX CAPUCINS,0212,54470,54518,Thiaucourt-Regniéville,54,,,545180000A0044,,,,,,,,,,,,,0,3,Dépendance,,0,S,sols,,,699,5.857021,48.954528
2023-707520,2023-10-20,000001,Vente,290000,,,BOUZAU MOULIN,B010,54470,54518,Thiaucourt-Regniéville,54,,,54518000ZN0009,,,,,,,,,,,,,0,,,,,BT,taillis simples,,,546,5.856725,48.954233
2023-708063,2023-11-03,000001,Vente,63000,8,,RUE NEUVE,0420,54470,54518,Thiaucourt-Regniéville,54,,,54518000AL0174,,,,,,,,,,,,,0,1,Maison,75,5,S,sols,,,84,5.866403,48.952603
2023-708807,2023-11-23,000001,Vente,1500,,,HACHE EN COTE,B053,54470,54518,Thiaucourt-Regniéville,54,,,54518000ZH0032,,,,,,,,,,,,,0,,,,,BT,taillis simples,,,3877,5.86315,48.959793
