id_mutation,date_mutation,numero_disposition,nature_mutation,valeur_fonciere,adresse_numero,adresse_suffixe,adresse_nom_voie,adresse_code_voie,code_postal,code_commune,nom_commune,code_departement,ancien_code_commune,ancien_nom_commune,id_parcelle,ancien_id_parcelle,numero_volume,lot1_numero,lot1_surface_carrez,lot2_numero,lot2_surface_carrez,lot3_numero,lot3_surface_carrez,lot4_numero,lot4_surface_carrez,lot5_numero,lot5_surface_carrez,nombre_lots,code_type_local,type_local,surface_reelle_bati,nombre_pieces_principales,code_nature_culture,nature_culture,code_nature_culture_speciale,nature_culture_speciale,surface_terrain,longitude,latitude
2023-710823,2023-01-19,000001,Vente,2000,,,CHEMIN D IVOIRY,B042,55270,55346,Montfaucon-d'Argonne,55,,,55346000AA0049,,,,,,,,,,,,,0,,,,,S,sols,,,390,5.131415,49.272165
2023-710826,2023-01-19,000001,Vente,630,,,LES BRIERES,B024,55270,55346,Montfaucon-d'Argonne,55,,,55346000ZB0008,,,,,,,,,,,,,0,,,,,P,prés,,,1400,5.146642,49.279954
2023-711079,2023-02-03,000001,Vente,32000,,,LE BOURG,B021,55270,55346,Montfaucon-d'Argonne,55,,,55346000AB0025,,,,,,,,,,,,,0,,,,,J,jardins,POTAG,Jardin potager,1700,5.138788,49.272005
2023-711079,2023-02-03,000001,Vente,32000,,,LE BOURG,B021,55270,55346,Montfaucon-d'Argonne,55,,,55346000AB0025,,,,,,,,,,,,,0,,,,,BR,futaies résineuses,,,147,5.138788,49.272005
2023-711169,2023-02-16,000001,Vente,45000,4,,RUE D ESPAGNE,0040,55270,55346,Montfaucon-d'Argonne,55,,,55346000AA0100,,,,,,,,,,,,,0,1,Maison,86,3,S,sols,,,205,5.133094,49.270886
2023-711172,2023-02-16,000001,Vente,21882,9004,,LE BOURG,B021,55270,55346,Montfaucon-d'Argonne,55,,,55346000AB0036,,,,,,,,,,,,,0,1,Maison,15,1,BS,taillis sous futaie,,,7000,5.139227,49.272544
2023-711172,2023-02-16,000001,Vente,21882,9004,,LE BOURG,B021,55270,55346,Montfaucon-d'Argonne,55,,,55346000AB0036,,,,,,,,,,,,,0,1,Maison,15,1,S,sols,,,63,5.139227,49.272544
2023-711172,2023-02-16,000001,Vente,21882,,,TROU DES CAILLOUX,B155,55270,55346,Montfaucon-d'Argonne,55,,,55346000ZB0065,,,,,,,,,,,,,0,,,,,L,landes,,,6756,5.153336,49.284063
2023-711172,2023-02-16,000001,Vente,21882,,,CHAMP PIERRON,B036,55270,55346,Montfaucon-d'Argonne,55,,,55346000ZC0037,,,,,,,,,,,,,0,,,,,T,terres,,,2990,5.134072,49.275674
2023-711172,2023-02-16,000001,Vente,21882,,,CHAMP PIERRON,B036,55270,55346,Montfaucon-d'Argonne,55,,,55346000ZC0040,,,,,,,,,,,,,0,,,,,VE,vergers,,,240,5.134895,49.276775
2023-711172,2023-02-16,000001,Vente,21882,,,CHAMP PIERRON,B036,55270,55346,Montfaucon-d'Argonne,55,,,55346000ZC0040,,,,,,,,,,,,,0,,,,,BR,futaies résineuses,,,450,5.134895,49.276775
2023-711172,2023-02-16,000001,Vente,21882,,,CHAMP PIERRON,B036,55270,55346,Montfaucon-d'Argonne,55,,,55346000ZC0040,,,,,,,,,,,,,0,,,,,B,bois,,,150,5.134895,49.276775
2023-711172,2023-02-16,000001,Vente,21882,,,CHAMP PIERRON,B036,55270,55346,Montfaucon-d'Argonne,55,,,55346000ZC0042,,,,,,,,,,,,,0,,,,,T,terres,,,1460,5.134995,49.276678
2023-711172,2023-02-16,000001,Vente,21882,,,LE BOURG,B021,55270,55346,Montfaucon-d'Argonne,55,,,55346000ZC0081,,,,,,,,,,,,,0,,,,,B,bois,,,1090,5.1397,49.272973
2023-711172,2023-02-16,000001,Vente,21882,,,LE BOURG,B021,55270,55346,Montfaucon-d'Argonne,55,,,55346000ZC0081,,,,,,,,,,,,,0,,,,,BR,futaies résineuses,,,3270,5.1397,49.272973
2023-711172,2023-02-16,000001,Vente,21882,,,LE BOURG,B021,55270,55346,Montfaucon-d'Argonne,55,,,55346000ZC0083,,,,,,,,,,,,,0,,,,,B,bois,,,537,5.140085,49.272494
2023-711172,2023-02-16,000001,Vente,21882,,,LE BOURG,B021,55270,55346,Montfaucon-d'Argonne,55,,,55346000ZC0083,,,,,,,,,,,,,0,,,,,BR,futaies résineuses,,,1613,5.140085,49.272494
2023-711172,2023-02-16,000001,Vente,21882,,,LES ARPENTS,B002,55270,55346,Montfaucon-d'Argonne,55,,,55346000ZE0014,,,,,,,,,,,,,0,,,,,BR,futaies résineuses,,,5200,5.160729,49.257355
2023-711172,2023-02-16,000001,Vente,21882,,,LES ARPENTS,B002,55270,55346,Montfaucon-d'Argonne,55,,,55346000ZE0015,,,,,,,,,,,,,0,,,,,BR,futaies résineuses,,,2370,5.162165,49.257716
2023-711172,2023-02-16,000001,Vente,21882,,,LES ARPENTS,B002,55270,55346,Montfaucon-d'Argonne,55,,,55346000ZE0016,,,,,,,,,,,,,0,,,,,BR,futaies résineuses,,,11690,5.160464,49.256868
2023-711172,2023-02-16,000001,Vente,21882,,,LES ARPENTS,B002,55270,55346,Montfaucon-d'Argonne,55,,,55346000ZE0028,,,,,,,,,,,,,0,,,,,BR,futaies résineuses,,,23530,5.149405,49.255108
2023-711172,2023-02-16,000001,Vente,21882,,,LES ARPENTS,B002,55270,55346,Montfaucon-d'Argonne,55,,,55346000ZE0029,,,,,,,,,,,,,0,,,,,BR,futaies résineuses,,,4990,5.150438,49.255221
2023-711727,2023-03-31,000001,Vente,5000,,,CLOS LE CHANTRE,B052,55270,55346,Montfaucon-d'Argonne,55,,,55346000AA0079,,,,,,,,,,,,,0,,,,,P,prés,,,5821,5.135213,49.271348
2023-711727,2023-03-31,000001,Vente,5000,,,RIPPE,B141,55270,55346,Montfaucon-d'Argonne,55,,,55346000ZD0025,,,,,,,,,,,,,0,,,,,L,landes,,,1000,5.143268,49.271716
2023-711727,2023-03-31,000001,Vente,5000,,,RIPPE,B141,55270,55346,Montfaucon-d'Argonne,55,,,55346000ZD0026,,,,,,,,,,,,,0,,,,,L,landes,,,2590,5.143613,49.271836
2023-711966,2023-04-21,000001,Vente,278900,9001,,PRE MONTANT,B133,55270,55346,Montfaucon-d'Argonne,55,,,55346000ZB0046,,,,,,,,,,,,,0,1,Maison,111,5,S,sols,,,1320,5.145031,49.286096
2023-711966,2023-04-21,000001,Vente,278900,9001,,PRE MONTANT,B133,55270,55346,Montfaucon-d'Argonne,55,,,55346000ZB0046,,,,,,,,,,,,,0,3,Dépendance,,0,S,sols,,,1320,5.145031,49.286096
2023-711966,2023-04-21,000001,Vente,278900,9001,,PRE MONTANT,B133,55270,55346,Montfaucon-d'Argonne,55,,,55346000ZB0046,,,,,,,,,,,,,0,3,Dépendance,,0,T,terres,,,4860,5.145031,49.286096
2023-711966,2023-04-21,000001,Vente,278900,9001,,PRE MONTANT,B133,55270,55346,Montfaucon-d'Argonne,55,,,55346000ZB0046,,,,,,,,,,,,,0,1,Maison,111,5,T,terres,,,4860,5.145031,49.286096
2023-711966,2023-04-21,000001,Vente,278900,9001,,PRE MONTANT,B133,55270,55346,Montfaucon-d'Argonne,55,,,55346000ZB0046,,,,,,,,,,,,,0,3,Dépendance,,0,E,eaux,ETANG,Etangs,2600,5.145031,49.286096
2023-711966,2023-04-21,000001,Vente,278900,9001,,PRE MONTANT,B133,55270,55346,Montfaucon-d'Argonne,55,,,55346000ZB0046,,,,,,,,,,,,,0,1,Maison,111,5,E,eaux,ETANG,Etangs,2600,5.145031,49.286096
2023-711966,2023-04-21,000001,Vente,278900,9001,,PRE MONTANT,B133,55270,55346,Montfaucon-d'Argonne,55,,,55346000ZB0046,,,,,,,,,,,,,0,3,Dépendance,,0,E,eaux,ETANG,Etangs,6680,5.145031,49.286096
2023-711966,2023-04-21,000001,Vente,278900,9001,,PRE MONTANT,B133,55270,55346,Montfaucon-d'Argonne,55,,,55346000ZB0046,,,,,,,,,,,,,0,1,Maison,111,5,E,eaux,ETANG,Etangs,6680,5.145031,49.286096
2023-711966,2023-04-21,000001,Vente,278900,9001,,PRE MONTANT,B133,55270,55346,Montfaucon-d'Argonne,55,,,55346000ZB0046,,,,,,,,,,,,,0,3,Dépendance,,0,P,prés,,,5600,5.145031,49.286096
2023-711966,2023-04-21,000001,Vente,278900,9001,,PRE MONTANT,B133,55270,55346,Montfaucon-d'Argonne,55,,,55346000ZB0046,,,,,,,,,,,,,0,1,Maison,111,5,P,prés,,,5600,5.145031,49.286096
2023-711966,2023-04-21,000001,Vente,278900,9001,,PRE MONTANT,B133,55270,55346,Montfaucon-d'Argonne,55,,,55346000ZB0046,,,,,,,,,,,,,0,3,Dépendance,,0,P,prés,,,5120,5.145031,49.286096
2023-711966,2023-04-21,000001,Vente,278900,9001,,PRE MONTANT,B133,55270,55346,Montfaucon-d'Argonne,55,,,55346000ZB0046,,,,,,,,,,,,,0,1,Maison,111,5,P,prés,,,5120,5.145031,49.286096
2023-711966,2023-04-21,000001,Vente,278900,9001,,PRE MONTANT,B133,55270,55346,Montfaucon-d'Argonne,55,,,55346000ZB0046,,,,,,,,,,,,,0,1,Maison,111,5,T,terres,,,4770,5.145031,49.286096
2023-711966,2023-04-21,000001,Vente,278900,9001,,PRE MONTANT,B133,55270,55346,Montfaucon-d'Argonne,55,,,55346000ZB0046,,,,,,,,,,,,,0,1,Maison,111,5,T,terres,,,4770,5.145031,49.286096
2023-711966,2023-04-21,000001,Vente,278900,9001,,PRE MONTANT,B133,55270,55346,Montfaucon-d'Argonne,55,,,55346000ZB0046,,,,,,,,,,,,,0,3,Dépendance,,0,T,terres,,,4770,5.145031,49.286096
2023-711966,2023-04-21,000001,Vente,278900,9001,,PRE MONTANT,B133,55270,55346,Montfaucon-d'Argonne,55,,,55346000ZB0046,,,,,,,,,,,,,0,3,Dépendance,,0,T,terres,,,4860,5.145031,49.286096
2023-711966,2023-04-21,000001,Vente,278900,9001,,PRE MONTANT,B133,55270,55346,Montfaucon-d'Argonne,55,,,55346000ZB0046,,,,,,,,,,,,,0,1,Maison,111,5,T,terres,,,4860,5.145031,49.286096
2023-711966,2023-04-21,000001,Vente,278900,9001,,PRE MONTANT,B133,55270,55346,Montfaucon-d'Argonne,55,,,55346000ZB0046,,,,,,,,,,,,,0,3,Dépendance,,0,T,terres,,,4770,5.145031,49.286096
2023-712357,2023-06-01,000001,Vente,1000,,,LES BRIERES,B024,55270,55346,Montfaucon-d'Argonne,55,,,55346000ZB0014,,,,,,,,,,,,,0,,,,,BP,peupleraies,,,6790,5.143988,49.279399
2023-713844,2023-09-22,000001,Vente,75000,12,,RUE D ESPAGNE,0040,55270,55346,Montfaucon-d'Argonne,55,,,55346000AA0061,,,,,,,,,,,,,0,1,Maison,120,4,S,sols,,,707,5.131887,49.272463
