id_mutation,date_mutation,numero_disposition,nature_mutation,valeur_fonciere,adresse_numero,adresse_suffixe,adresse_nom_voie,adresse_code_voie,code_postal,code_commune,nom_commune,code_departement,ancien_code_commune,ancien_nom_commune,id_parcelle,ancien_id_parcelle,numero_volume,lot1_numero,lot1_surface_carrez,lot2_numero,lot2_surface_carrez,lot3_numero,lot3_surface_carrez,lot4_numero,lot4_surface_carrez,lot5_numero,lot5_surface_carrez,nombre_lots,code_type_local,type_local,surface_reelle_bati,nombre_pieces_principales,code_nature_culture,nature_culture,code_nature_culture_speciale,nature_culture_speciale,surface_terrain,longitude,latitude
2023-715165,2023-01-06,000002,Vente,19300,,,LE BOURG,B053,56250,56231,Saint-Nolff,56,,,56231000AA0231,,,,,,,,,,,,,0,,,,,S,sols,,,386,-2.651612,47.702624
2023-715379,2023-01-13,000001,Vente,280000,5280,B,LESTENO,B495,56250,56231,Saint-Nolff,56,,,562310000E0799,,,,,,,,,,,,,0,1,Maison,69,3,J,jardins,,,2000,-2.676546,47.681831
2023-715379,2023-01-13,000001,Vente,280000,5280,B,LESTENO,B495,56250,56231,Saint-Nolff,56,,,562310000E0799,,,,,,,,,,,,,0,1,Maison,69,3,S,sols,,,500,-2.676546,47.681831
2023-715563,2023-01-30,000001,Vente,300000,6241,,ZA DE KERBOULARD,B894,56250,56231,Saint-Nolff,56,,,56231000AM0068,,,,,,,,,,,,,0,4,Local industriel. commercial ou assimilé,1520,0,S,sols,,,1520,-2.638785,47.69435
2023-715845,2023-01-28,000001,Vente,173000,6,,VEN MARC CHAGALL,0221,56250,56231,Saint-Nolff,56,,,562310000B1550,,,,,,,,,,,,,0,1,Maison,45,2,S,sols,,,234,-2.655363,47.708085
2023-715941,2023-01-13,000002,Vente,319950,,,LA POINTE,B658,56250,56231,Saint-Nolff,56,,,56231000AH0135,,,,,,,,,,,,,0,,,,,L,landes,,,183,-2.692766,47.687291
2023-715941,2023-01-13,000002,Vente,319950,,,LA POINTE,B658,56250,56231,Saint-Nolff,56,,,56231000AH0166,,,,,,,,,,,,,0,,,,,S,sols,,,166,-2.693114,47.687241
2023-715941,2023-01-13,000002,Vente,319950,3,T,LA POINTE,B658,56250,56231,Saint-Nolff,56,,,56231000AH0265,,,,,,,,,,,,,0,1,Maison,110,6,,,,,,-2.693474,47.686947
2023-715988,2023-02-03,000001,Vente,285000,3,,RUE DE L'ECOLE DILLIEC,0230,56250,56231,Saint-Nolff,56,,,56231000AI0016,,,,,,,,,,,,,0,3,Dépendance,,0,S,sols,,,835,-2.682728,47.686675
2023-715988,2023-02-03,000001,Vente,285000,3,,RUE DE L'ECOLE DILLIEC,0230,56250,56231,Saint-Nolff,56,,,56231000AI0016,,,,,,,,,,,,,0,1,Maison,99,4,S,sols,,,835,-2.682728,47.686675
2023-716116,2023-02-01,000001,Vente,250000,5319,,LESCRAN,B494,56250,56231,Saint-Nolff,56,,,562310000F0455,,,,,,,,,,,,,0,3,Dépendance,,0,S,sols,,,961,-2.653171,47.684513
2023-716116,2023-02-01,000001,Vente,250000,5319,,LESCRAN,B494,56250,56231,Saint-Nolff,56,,,562310000F0455,,,,,,,,,,,,,0,1,Maison,88,3,S,sols,,,961,-2.653171,47.684513
2023-716116,2023-02-01,000001,Vente,250000,5319,,LESCRAN,B494,56250,56231,Saint-Nolff,56,,,562310000F0455,,,,,,,,,,,,,0,3,Dépendance,,0,S,sols,,,961,-2.653171,47.684513
2023-716116,2023-02-01,000001,Vente,250000,5319,,LESCRAN,B494,56250,56231,Saint-Nolff,56,,,562310000F0455,,,,,,,,,,,,,0,3,Dépendance,,0,S,sols,,,961,-2.653171,47.684513
2023-716116,2023-02-01,000001,Vente,250000,,,LE CHAMP DE HAUT,B080,56250,56231,Saint-Nolff,56,,,562310000F1447,,,,,,,,,,,,,0,,,,,T,terres,,,1273,-2.653382,47.684563
2023-716585,2023-03-03,000002,Vente,470000,5,,RUE LOIC CARADEC,0220,56250,56231,Saint-Nolff,56,,,56231000AB0176,,,,,,,,,,,,,0,1,Maison,185,6,,,,,,-2.65164,47.705251
2023-716596,2023-03-08,000001,Vente,610000,,,LA GARE,B289,56250,56231,Saint-Nolff,56,,,562310000C0575,,,,,,,,,,,,,0,,,,,S,sols,,,52,-2.627082,47.701103
2023-716596,2023-03-08,000001,Vente,610000,5420,,QUINIAC,B781,56250,56231,Saint-Nolff,56,,,562310000C0576,,,,,,,,,,,,,0,2,Appartement,74,3,S,sols,,,647,-2.627007,47.700956
2023-716596,2023-03-08,000001,Vente,610000,5420,,QUINIAC,B781,56250,56231,Saint-Nolff,56,,,562310000C0576,,,,,,,,,,,,,0,2,Appartement,42,2,S,sols,,,647,-2.627007,47.700956
2023-716596,2023-03-08,000001,Vente,610000,5420,,QUINIAC,B781,56250,56231,Saint-Nolff,56,,,562310000C0576,,,,,,,,,,,,,0,2,Appartement,67,3,S,sols,,,647,-2.627007,47.700956
2023-716596,2023-03-08,000001,Vente,610000,5166,,QUINIAC,B781,56250,56231,Saint-Nolff,56,,,562310000C0577,,,,,,,,,,,,,0,1,Maison,90,3,S,sols,,,286,-2.627213,47.700983
2023-716596,2023-03-08,000001,Vente,610000,,,DEPENDANCE DE LA GARE D EL,B257,56250,56231,Saint-Nolff,56,,,562310000C1628,,,,,,,,,,,,,0,,,,,J,jardins,,,519,-2.627511,47.700909
2023-716769,2023-02-24,000001,Vente,390000,5394,,LA POINTE,B658,56250,56231,Saint-Nolff,56,,,56231000AH0138,,,,,,,,,,,,,0,1,Maison,141,6,J,jardins,,,4007,-2.693689,47.687793
2023-716769,2023-02-24,000001,Vente,390000,5394,,LA POINTE,B658,56250,56231,Saint-Nolff,56,,,56231000AH0138,,,,,,,,,,,,,0,1,Maison,141,6,S,sols,,,1332,-2.693689,47.687793
2023-716810,2023-03-07,000001,Vente,575000,,,PRE DE GOURVINEC,B700,56250,56231,Saint-Nolff,56,,,56231000AA0103,,,,,,,,,,,,,0,,,,,P,prés,,,1161,-2.657572,47.703168
2023-716810,2023-03-07,000001,Vente,575000,11,,RUE DE LA FORGE,0140,56250,56231,Saint-Nolff,56,,,56231000AA0104,,,,,,,,,,,,,0,1,Maison,190,7,S,sols,,,775,-2.657109,47.702935
2023-716810,2023-03-07,000001,Vente,575000,11,,RUE DE LA FORGE,0140,56250,56231,Saint-Nolff,56,,,56231000AA0104,,,,,,,,,,,,,0,1,Maison,190,7,J,jardins,,,749,-2.657109,47.702935
2023-716810,2023-03-07,000001,Vente,575000,,,LE GOURVINEC,B296,56250,56231,Saint-Nolff,56,,,56231000AA0187,,,,,,,,,,,,,0,,,,,S,sols,,,40,-2.656786,47.703011
2023-717039,2023-03-18,000001,Vente,87000,,,RUE DES PEUPLIERS,0156,56250,56231,Saint-Nolff,56,,,56231000AC0176,,,,,,,,,,,,,0,,,,,AB,terrains a bâtir,,,501,-2.645213,47.701761
2023-717060,2023-03-22,000002,Vente,1,,,CLOS DE LA JUSTICE,B168,56250,56231,Saint-Nolff,56,,,56231000AH0263,,,,,,,,,,,,,0,,,,,L,landes,,,85,-2.688164,47.690517
2023-717068,2023-03-22,000001,Vente,1,,,CLOS DE LA JUSTICE,B168,56250,56231,Saint-Nolff,56,,,56231000AH0264,,,,,,,,,,,,,0,,,,,L,landes,,,92,-2.688331,47.690366
2023-717101,2023-03-18,000001,Vente,6800,,,LAGRANDE LANDE,B376,56250,56231,Saint-Nolff,56,,,562310000C1199,,,,,,,,,,,,,0,,,,,T,terres,,,15100,-2.660054,47.69795
2023-717225,2023-03-17,000002,Vente,82000,,,FERME DE KERBOULARD,B279,56250,56231,Saint-Nolff,56,,,562310000C0115,,,,,,,,,,,,,0,,,,,P,prés,,,4280,-2.635018,47.698346
2023-717225,2023-03-17,000002,Vente,82000,,,FERME DE KERBOULARD,B279,56250,56231,Saint-Nolff,56,,,562310000C0116,,,,,,,,,,,,,0,,,,,J,jardins,,,1512,-2.635661,47.698235
2023-717225,2023-03-17,000002,Vente,82000,,,FERME DE KERBOULARD,B279,56250,56231,Saint-Nolff,56,,,562310000C0116,,,,,,,,,,,,,0,,,,,P,prés,,,1736,-2.635661,47.698235
2023-717225,2023-03-17,000002,Vente,82000,,,FERME DE KERBOULARD,B279,56250,56231,Saint-Nolff,56,,,562310000C0983,,,,,,,,,,,,,0,,,,,L,landes,,,1545,-2.634668,47.698874
2023-717225,2023-03-17,000002,Vente,82000,,,KERBOULARD,B361,56250,56231,Saint-Nolff,56,,,562310000C1750,,,,,,,,,,,,,0,,,,,S,sols,,,329,-2.635959,47.698114
2023-717522,2023-04-06,000001,Vente,134000,5312,A,LESTENO,B495,56250,56231,Saint-Nolff,56,,,56231000AL0055,,,,,,,,,,,,,0,3,Dépendance,,0,S,sols,,,854,-2.665066,47.680344
2023-717522,2023-04-06,000001,Vente,134000,5312,A,LESTENO,B495,56250,56231,Saint-Nolff,56,,,56231000AL0055,,,,,,,,,,,,,0,1,Maison,150,7,S,sols,,,854,-2.665066,47.680344
2023-717522,2023-04-06,000001,Vente,134000,5312,A,LESTENO,B495,56250,56231,Saint-Nolff,56,,,56231000AL0055,,,,,,,,,,,,,0,3,Dépendance,,0,J,jardins,,,1426,-2.665066,47.680344
2023-717522,2023-04-06,000001,Vente,134000,5312,A,LESTENO,B495,56250,56231,Saint-Nolff,56,,,56231000AL0055,,,,,,,,,,,,,0,1,Maison,150,7,J,jardins,,,1426,-2.665066,47.680344
2023-717522,2023-04-06,000001,Vente,134000,,,PETIT CHAMP DE BERGUENAN,B609,56250,56231,Saint-Nolff,56,,,56231000AL0056,,,,,,,,,,,,,0,,,,,P,prés,,,997,-2.664991,47.68002
2023-717538,2023-03-23,000001,Vente,559830,10,B,LANDE DE KERHON,B401,56250,56231,Saint-Nolff,56,,,56231000AN0139,,,,,,,,,,,,,0,1,Maison,174,5,S,sols,,,1121,-2.663154,47.694496
2023-717538,2023-03-23,000001,Vente,559830,10,B,LANDE DE KERHON,B401,56250,56231,Saint-Nolff,56,,,56231000AN0139,,,,,,,,,,,,,0,3,Dépendance,,0,S,sols,,,1121,-2.663154,47.694496
2023-717581,2023-03-21,000001,Vente,420000,6041,,LOT DU CLOS DU POIRIER,B876,56250,56231,Saint-Nolff,56,,,56231000AK0065,,,,,,,,,,,,,0,1,Maison,160,6,S,sols,,,1367,-2.705131,47.67622
2023-717581,2023-03-21,000001,Vente,420000,9001,,LOT DU CLOS DU POIRIER,B876,56250,56231,Saint-Nolff,56,,,56231000AK0118,,,,,,,,,,,,,0,4,Local industriel. commercial ou assimilé,,0,S,sols,,,46,-2.703665,47.675525
2023-717581,2023-03-21,000001,Vente,420000,,,LOT DU CLOS DU POIRIER,B876,56250,56231,Saint-Nolff,56,,,56231000AK0125,,,,,,,,,,,,,0,,,,,L,landes,,,1233,-2.703878,47.675729
2023-717581,2023-03-21,000001,Vente,420000,,,LOT DU CLOS DU POIRIER,B876,56250,56231,Saint-Nolff,56,,,56231000AK0126,,,,,,,,,,,,,0,,,,,L,landes,,,4660,-2.703216,47.674985
2023-717581,2023-03-21,000001,Vente,420000,,,LOT DU CLOS DU POIRIER,B876,56250,56231,Saint-Nolff,56,,,56231000AK0127,,,,,,,,,,,,,0,,,,,L,landes,,,1390,-2.703793,47.67456
2023-717581,2023-03-21,000001,Vente,420000,,,LOT DU CLOS DU POIRIER,B876,56250,56231,Saint-Nolff,56,,,56231000AK0128,,,,,,,,,,,,,0,,,,,L,landes,,,261,-2.702786,47.674391
2023-717581,2023-03-21,000001,Vente,420000,,,LOT DU CLOS DU POIRIER,B876,56250,56231,Saint-Nolff,56,,,56231000AK0129,,,,,,,,,,,,,0,,,,,L,landes,,,1166,-2.702438,47.674811
2023-717627,2023-03-30,000001,Vente,168000,5226,,BEL ORIENT,B020,56250,56231,Saint-Nolff,56,,,56231000AD0291,,,,,,,,,,,,,0,1,Maison,70,4,S,sols,,,796,-2.682974,47.699155
2023-717667,2023-04-03,000001,Vente,115000,1,B,RUE MARIE MOISAN,0151,56250,56231,Saint-Nolff,56,,,56231000AA0093,,,20,,,,,,,,,,1,3,Dépendance,,0,,,,,,-2.655863,47.703801
2023-717667,2023-04-03,000001,Vente,115000,1,B,RUE MARIE MOISAN,0151,56250,56231,Saint-Nolff,56,,,56231000AA0093,,,67,,82,36.62,,,,,,,2,2,Appartement,39,2,,,,,,-2.655863,47.703801
2023-717667,2023-04-03,000001,Vente,115000,1,B,RUE MARIE MOISAN,0151,56250,56231,Saint-Nolff,56,,,56231000AA0093,,,67,,82,36.62,,,,,,,2,3,Dépendance,,0,,,,,,-2.655863,47.703801
2023-717667,2023-04-03,000001,Vente,115000,,,RUE MARIE MOISAN,0151,56250,56231,Saint-Nolff,56,,,56231000AA0094,,,,,,,,,,,,,0,,,,,S,sols,,,1450,-2.656195,47.703603
2023-717667,2023-04-03,000001,Vente,115000,,,RUE DE LA FORGE,0140,56250,56231,Saint-Nolff,56,,,56231000AA0097,,,,,,,,,,,,,0,,,,,S,sols,,,824,-2.656703,47.703286
2023-717667,2023-04-03,000001,Vente,115000,,,RUE DE LA FORGE,0140,56250,56231,Saint-Nolff,56,,,56231000AA0193,,,,,,,,,,,,,0,,,,,S,sols,,,115,-2.656526,47.703244
2023-717926,2023-04-06,000001,Vente,440000,4,,RUE DU VIEUX COUVENT,0190,56250,56231,Saint-Nolff,56,,,56231000AC0125,,,,,,,,,,,,,0,1,Maison,196,6,S,sols,,,500,-2.650905,47.701835
2023-717926,2023-04-06,000001,Vente,440000,4,,RUE DU VIEUX COUVENT,0190,56250,56231,Saint-Nolff,56,,,56231000AC0125,,,,,,,,,,,,,0,1,Maison,196,6,J,jardins,,,866,-2.650905,47.701835
2023-717934,2023-03-30,000001,Vente,100000,9,,VEN PAUL GAUGUIN,0196,56250,56231,Saint-Nolff,56,,,562310000B1684,,,,,,,,,,,,,0,1,Maison,77,2,S,sols,,,366,-2.655012,47.708718
2023-718036,2023-03-31,000001,Vente,85000,5199,,LE BOURG,B053,56250,56231,Saint-Nolff,56,,,56231000AC0027,,,,,,,,,,,,,0,1,Maison,102,4,S,sols,,,371,-2.647707,47.702374
2023-718036,2023-03-31,000001,Vente,85000,5199,,LE BOURG,B053,56250,56231,Saint-Nolff,56,,,56231000AC0027,,,,,,,,,,,,,0,3,Dépendance,,0,S,sols,,,371,-2.647707,47.702374
2023-718078,2023-04-21,000001,Vente,243000,2,,RES BEAU SOLEIL,A004,56250,56231,Saint-Nolff,56,,,56231000AD0178,,,,,,,,,,,,,0,1,Maison,100,6,S,sols,,,563,-2.683407,47.698591
2023-718544,2023-05-23,000002,Vente,,,,RUE DU VIEUX COUVENT,0190,56250,56231,Saint-Nolff,56,,,56231000AC0178,,,,,,,,,,,,,0,,,,,S,sols,,,207,-2.652008,47.701555
2023-718544,2023-05-23,000002,Vente,,,,RUE DU VIEUX COUVENT,0190,56250,56231,Saint-Nolff,56,,,56231000AC0180,,,,,,,,,,,,,0,,,,,S,sols,,,42,-2.652289,47.70153
2023-718693,2023-05-25,000001,Vente,5273858,,,ER LOS BRAS,B274,56250,56231,Saint-Nolff,56,,,562310000C1733,,,,,,,,,,,,,0,,,,,AB,terrains a bâtir,,,688,-2.652646,47.700852
2023-718693,2023-05-25,000001,Vente,5273858,,,ER LOS BRAS,B274,56250,56231,Saint-Nolff,56,,,562310000C1734,,,,,,,,,,,,,0,,,,,AB,terrains a bâtir,,,758,-2.652431,47.700682
2023-718876,2023-05-24,000001,Vente,246000,,,LE CHAMP DE KERLOC,B084,56250,56231,Saint-Nolff,56,,,562310000B1633,,,,,,,,,,,,,0,,,,,AB,terrains a bâtir,,,241,-2.65333,47.708371
2023-719215,2023-06-13,000001,Vente,121000,5091,,KERHUIL,B310,56250,56231,Saint-Nolff,56,,,562310000B1571,,,,,,,,,,,,,0,1,Maison,50,1,S,sols,,,263,-2.643332,47.714225
2023-719215,2023-06-13,000001,Vente,121000,5091,,KERHUIL,B310,56250,56231,Saint-Nolff,56,,,562310000B1571,,,,,,,,,,,,,0,3,Dépendance,,0,S,sols,,,263,-2.643332,47.714225
2023-719215,2023-06-13,000001,Vente,121000,,,GRANDE LANDE,B329,56250,56231,Saint-Nolff,56,,,562310000B1576,,,,,,,,,,,,,0,,,,,S,sols,,,69,-2.643334,47.714292
2023-719287,2023-05-17,000001,Vente,402500,5836,,RUE JEAN PIERRE CALLOC'H,0147,56250,56231,Saint-Nolff,56,,,56231000AA0037,,,,,,,,,,,,,0,1,Maison,145,5,S,sols,,,656,-2.656023,47.705492
2023-720214,2023-07-11,000001,Vente,1500,,,RTE DE SAINT COLOMBIER,0293,56250,56231,Saint-Nolff,56,,,56231000AD0269,,,,,,,,,,,,,0,,,,,S,sols,,,43,-2.67947,47.698101
2023-720214,2023-07-11,000001,Vente,1500,,,RTE DE SAINT COLOMBIER,0293,56250,56231,Saint-Nolff,56,,,56231000AD0279,,,,,,,,,,,,,0,,,,,S,sols,,,496,-2.679071,47.698145
2023-720214,2023-07-11,000001,Vente,1500,,,RTE DE SAINT COLOMBIER,0293,56250,56231,Saint-Nolff,56,,,56231000AD0280,,,,,,,,,,,,,0,,,,,S,sols,,,46,-2.67956,47.698107
2023-720310,2023-06-27,000001,Vente,425000,5609,,LA GREE,B342,56250,56231,Saint-Nolff,56,,,56231000AL0006,,,,,,,,,,,,,0,1,Maison,213,8,S,sols,,,1198,-2.663116,47.68067
2023-720310,2023-06-27,000001,Vente,425000,5609,,LA GREE,B342,56250,56231,Saint-Nolff,56,,,56231000AL0006,,,,,,,,,,,,,0,1,Maison,213,8,J,jardins,,,1221,-2.663116,47.68067
2023-720471,2023-07-17,000001,Vente,12989,,,LE CLOS DAMAND,B159,56250,56231,Saint-Nolff,56,,,562310000A0034,,,,,,,,,,,,,0,,,,,T,terres,,,6115,-2.660639,47.734431
2023-720471,2023-07-17,000001,Vente,12989,,,LANDE DU CLOS ROMARD,B437,56250,56231,Saint-Nolff,56,,,562310000A0189,,,,,,,,,,,,,0,,,,,T,terres,,,15145,-2.662103,47.74002
2023-720471,2023-07-17,000001,Vente,12989,,,LANDE DU CLOS ROMARD,B437,56250,56231,Saint-Nolff,56,,,562310000A0190,,,,,,,,,,,,,0,,,,,P,prés,,,6925,-2.661771,47.741464
2023-721416,2023-08-17,000001,Vente,455000,8,,IMP XAVIER GRALL,0194,56250,56231,Saint-Nolff,56,,,56231000AA0046,,,,,,,,,,,,,0,1,Maison,89,5,S,sols,,,644,-2.657181,47.704393
2023-721452,2023-08-01,000001,Vente,348000,5562,,ER PORHO,B671,56250,56231,Saint-Nolff,56,,,56231000AK0006,,,,,,,,,,,,,0,1,Maison,147,6,S,sols,,,684,-2.703757,47.679614
2023-721452,2023-08-01,000001,Vente,348000,5562,,ER PORHO,B671,56250,56231,Saint-Nolff,56,,,56231000AK0006,,,,,,,,,,,,,0,1,Maison,147,6,J,jardins,,,565,-2.703757,47.679614
2023-721499,2023-08-21,000001,Vente,65000,1,,PL OLIVIER MOUSSY,0278,56250,56231,Saint-Nolff,56,,,56231000AB0074,,,,,,,,,,,,,0,1,Maison,76,5,S,sols,,,361,-2.652341,47.705231
2023-721508,2023-08-25,000002,Vente,134,,,RESIDENCE AVEL MOR,B918,56250,56231,Saint-Nolff,56,,,56231000AH0161,,,,,,,,,,,,,0,,,,,L,landes,,,134,,
2023-721581,2023-09-01,000001,Vente,25000,,,LA GRANDE LANDE,B330,56250,56231,Saint-Nolff,56,,,562310000E0033,,,,,,,,,,,,,0,,,,,L,landes,,,23590,-2.669638,47.683428
2023-721581,2023-09-01,000001,Vente,25000,,,LA GRANDE LANDE,B330,56250,56231,Saint-Nolff,56,,,562310000E0034,,,,,,,,,,,,,0,,,,,P,prés,,,2175,-2.669217,47.683593
2023-721581,2023-09-01,000001,Vente,25000,,,LA GRANDE LANDE,B330,56250,56231,Saint-Nolff,56,,,562310000E0036,,,,,,,,,,,,,0,,,,,P,prés,,,22160,-2.671438,47.682884
2023-721581,2023-09-01,000001,Vente,25000,,,LA GRANDE LANDE,B330,56250,56231,Saint-Nolff,56,,,562310000E0039,,,,,,,,,,,,,0,,,,,T,terres,,,13940,-2.673323,47.682382
2023-721581,2023-09-01,000001,Vente,25000,,,LA GRANDE LANDE,B330,56250,56231,Saint-Nolff,56,,,562310000E0040,,,,,,,,,,,,,0,,,,,L,landes,,,21220,-2.674178,47.683063
2023-721601,2023-08-31,000001,Vente,8000,,,LE GRAND PRE,B319,56250,56231,Saint-Nolff,56,,,56231000AA0003,,,,,,,,,,,,,0,,,,,L,landes,,,8100,-2.658027,47.706138
2023-721601,2023-08-31,000001,Vente,8000,,,LE COUEDIC,B218,56250,56231,Saint-Nolff,56,,,56231000AA0154,,,,,,,,,,,,,0,,,,,P,prés,,,3446,-2.658641,47.705915
2023-721694,2023-09-07,000001,Vente,158000,5162,,QUINIAC,B781,56250,56231,Saint-Nolff,56,,,562310000C1107,,,,,,,,,,,,,0,1,Maison,66,3,S,sols,,,451,-2.625532,47.700977
2023-721697,2023-09-01,000001,Vente,10000,,,LE TORAILLEU,B826,56250,56231,Saint-Nolff,56,,,562310000B0228,,,,,,,,,,,,,0,,,,,L,landes,,,14800,-2.663725,47.706227
2023-721855,2023-08-29,000001,Vente,131000,,,LESCRAN,B494,56250,56231,Saint-Nolff,56,,,562310000F0456,,,,,,,,,,,,,0,,,,,S,sols,,,125,-2.653169,47.684288
2023-721855,2023-08-29,000001,Vente,131000,,,LE PRE,B691,56250,56231,Saint-Nolff,56,,,562310000F0459,,,,,,,,,,,,,0,,,,,P,prés,,,1155,-2.652979,47.684172
2023-721910,2023-09-14,000001,Vente,120000,5333,,TREFLIS,B836,56250,56231,Saint-Nolff,56,,,562310000F0895,,,,,,,,,,,,,0,1,Maison,62,2,S,sols,,,256,-2.654697,47.692932
2023-721910,2023-09-14,000001,Vente,120000,5333,,TREFLIS,B836,56250,56231,Saint-Nolff,56,,,562310000F0895,,,,,,,,,,,,,0,3,Dépendance,,0,S,sols,,,256,-2.654697,47.692932
2023-721910,2023-09-14,000001,Vente,120000,5333,,TREFLIS,B836,56250,56231,Saint-Nolff,56,,,562310000F0895,,,,,,,,,,,,,0,3,Dépendance,,0,S,sols,,,256,-2.654697,47.692932
2023-721910,2023-09-14,000001,Vente,120000,,,LANDIER DU GRAND CHEMIN,B483,56250,56231,Saint-Nolff,56,,,562310000F0896,,,,,,,,,,,,,0,,,,,T,terres,,,686,-2.654548,47.692739
2023-721930,2023-08-30,000001,Vente,290000,4,,RUE DES LAVANDIERES,0150,56250,56231,Saint-Nolff,56,,,56231000AB0031,,,,,,,,,,,,,0,1,Maison,96,4,S,sols,,,103,-2.651309,47.703539
2023-722036,2023-09-20,000001,Vente,201430,6174,,IMP ANATOLE LE BRAZ,0262,56250,56231,Saint-Nolff,56,,,562310000B1350,,,4,,,,,,,,,,1,1,Maison,59,3,,,,,,-2.661932,47.705761
2023-722036,2023-09-20,000001,Vente,201430,6165,,IMP ANATOLE LE BRAZ,0262,56250,56231,Saint-Nolff,56,,,562310000B1350,,,13,,,,,,,,,,1,3,Dépendance,,0,,,,,,-2.661932,47.705761
2023-722036,2023-09-20,000001,Vente,201430,6165,,IMP ANATOLE LE BRAZ,0262,56250,56231,Saint-Nolff,56,,,562310000B1350,,,14,,,,,,,,,,1,3,Dépendance,,0,,,,,,-2.661932,47.705761
2023-722060,2023-09-08,000001,Vente,320370,7,,RUE PER JAKEZ HELIAS,0345,56250,56231,Saint-Nolff,56,,,562310000B1341,,,,,,,,,,,,,0,1,Maison,108,4,S,sols,,,530,-2.66029,47.70621
2023-722126,2023-09-21,000001,Vente,460000,5920,,TREFLIS,B836,56250,56231,Saint-Nolff,56,,,562310000F0381,,,,,,,,,,,,,0,1,Maison,128,6,S,sols,,,317,-2.655072,47.689581
2023-722126,2023-09-21,000001,Vente,460000,,,PRE LE ROI,B756,56250,56231,Saint-Nolff,56,,,562310000F0410,,,,,,,,,,,,,0,,,,,P,prés,,,3755,-2.654712,47.689708
2023-722126,2023-09-21,000001,Vente,460000,,,PETIT CLOS,B614,56250,56231,Saint-Nolff,56,,,562310000F0411,,,,,,,,,,,,,0,,,,,P,prés,,,5250,-2.653669,47.689573
2023-722225,2023-09-26,000001,Vente,347000,5311,B,LESTENO,B495,56250,56231,Saint-Nolff,56,,,56231000AL0142,,,,,,,,,,,,,0,1,Maison,135,6,S,sols,,,500,-2.668425,47.679821
2023-722225,2023-09-26,000001,Vente,347000,5311,B,LESTENO,B495,56250,56231,Saint-Nolff,56,,,56231000AL0142,,,,,,,,,,,,,0,1,Maison,135,6,J,jardins,,,975,-2.668425,47.679821
2023-722225,2023-09-26,000001,Vente,347000,,,LESTENO,B495,56250,56231,Saint-Nolff,56,,,56231000AL0143,,,,,,,,,,,,,0,,,,,S,sols,,,91,-2.668741,47.679837
2023-722225,2023-09-26,000001,Vente,347000,,,LA LANDE DU GREC,B442,56250,56231,Saint-Nolff,56,,,56231000AL0147,,,,,,,,,,,,,0,,,,,P,prés,,,7,-2.668791,47.680008
2023-722225,2023-09-26,000001,Vente,347000,,,LA LANDE DU GREC,B442,56250,56231,Saint-Nolff,56,,,56231000AL0149,,,,,,,,,,,,,0,,,,,S,sols,,,124,-2.668516,47.679667
2023-722225,2023-09-26,000001,Vente,347000,,,LA LANDE DU GREC,B442,56250,56231,Saint-Nolff,56,,,56231000AL0152,,,,,,,,,,,,,0,,,,,S,sols,,,40,-2.66856,47.679695
2023-723085,2023-10-24,000001,Vente,250000,,,LE GRAND CLOS,B304,56250,56231,Saint-Nolff,56,,,562310000B0451,,,,,,,,,,,,,0,,,,,T,terres,,,31280,-2.63634,47.705966
2023-723085,2023-10-24,000001,Vente,250000,5102,,KERNION,B372,56250,56231,Saint-Nolff,56,,,562310000B0452,,,,,,,,,,,,,0,1,Maison,126,3,S,sols,,,1045,-2.637575,47.706588
2023-723085,2023-10-24,000001,Vente,250000,,,KERNION,B372,56250,56231,Saint-Nolff,56,,,562310000B0453,,,,,,,,,,,,,0,,,,,J,jardins,,,400,-2.637654,47.706351
2023-723085,2023-10-24,000001,Vente,250000,,,KERNION,B372,56250,56231,Saint-Nolff,56,,,562310000B0454,,,,,,,,,,,,,0,,,,,J,jardins,,,355,-2.637939,47.706305
2023-723085,2023-10-24,000001,Vente,250000,,,KERNION,B372,56250,56231,Saint-Nolff,56,,,562310000B0455,,,,,,,,,,,,,0,,,,,T,terres,,,1980,-2.637829,47.705984
2023-723085,2023-10-24,000001,Vente,250000,,,LE PETIT CLOS,B613,56250,56231,Saint-Nolff,56,,,562310000B0456,,,,,,,,,,,,,0,,,,,T,terres,,,15450,-2.636369,47.705002
2023-723085,2023-10-24,000001,Vente,250000,,,LA PATURE,B563,56250,56231,Saint-Nolff,56,,,562310000B0462,,,,,,,,,,,,,0,,,,,P,prés,,,6440,-2.636105,47.703067
2023-723085,2023-10-24,000001,Vente,250000,,,PRE DU COURS,B726,56250,56231,Saint-Nolff,56,,,562310000B0463,,,,,,,,,,,,,0,,,,,P,prés,,,6300,-2.634658,47.703826
2023-723144,2023-10-20,000001,Vente,583289,6,,RUE DU CHATEAU,0138,56250,56231,Saint-Nolff,56,,,56231000AB0164,,,,,,,,,,,,,0,3,Dépendance,,0,S,sols,,,1000,-2.653866,47.705314
2023-723144,2023-10-20,000001,Vente,583289,6,,RUE DU CHATEAU,0138,56250,56231,Saint-Nolff,56,,,56231000AB0164,,,,,,,,,,,,,0,3,Dépendance,,0,J,jardins,,,539,-2.653866,47.705314
2023-723144,2023-10-20,000001,Vente,583289,6,,RUE DU CHATEAU,0138,56250,56231,Saint-Nolff,56,,,56231000AB0164,,,,,,,,,,,,,0,1,Maison,160,6,S,sols,,,1000,-2.653866,47.705314
2023-723144,2023-10-20,000001,Vente,583289,6,,RUE DU CHATEAU,0138,56250,56231,Saint-Nolff,56,,,56231000AB0164,,,,,,,,,,,,,0,1,Maison,160,6,J,jardins,,,539,-2.653866,47.705314
2023-723144,2023-10-20,000001,Vente,583289,6,,RUE DU CHATEAU,0138,56250,56231,Saint-Nolff,56,,,56231000AB0166,,,,,,,,,,,,,0,,,,,S,sols,,,249,-2.654178,47.705218
2023-723144,2023-10-20,000001,Vente,583289,6,,RUE DU CHATEAU,0138,56250,56231,Saint-Nolff,56,,,56231000AB0167,,,,,,,,,,,,,0,,,,,S,sols,,,12,-2.65394,47.705177
2023-723233,2023-10-31,000001,Vente,389000,6037,,BEL ORIENT,B020,56250,56231,Saint-Nolff,56,,,56231000AD0035,,,,,,,,,,,,,0,1,Maison,120,5,S,sols,,,823,-2.677152,47.701216
2023-723619,2023-11-06,000001,Vente,2010,,,LE PONT FILIO,B670,56250,56231,Saint-Nolff,56,,,562310000D0237,,,,,,,,,,,,,0,,,,,P,prés,,,4020,-2.7192,47.679518
2023-723633,2023-11-07,000001,Vente,150000,,,TANNAY,B821,56250,56231,Saint-Nolff,56,,,562310000B0277,,,,,,,,,,,,,0,,,,,L,landes,,,120,-2.668413,47.713058
2023-723633,2023-11-07,000001,Vente,150000,,,TANNAY,B821,56250,56231,Saint-Nolff,56,,,562310000B0606,,,,,,,,,,,,,0,,,,,L,landes,,,149,-2.668461,47.71284
2023-723633,2023-11-07,000001,Vente,150000,5020,,TANNAY,B821,56250,56231,Saint-Nolff,56,,,562310000B1750,,,,,,,,,,,,,0,1,Maison,67,1,,,,,,-2.667768,47.711866
2023-723654,2023-11-14,000001,Vente,320000,11,,IMP GRAND PRE,0250,56250,56231,Saint-Nolff,56,,,56231000AA0156,,,,,,,,,,,,,0,1,Maison,130,6,S,sols,,,540,-2.654593,47.706634
2023-723868,2023-11-17,000001,Vente,335000,11,,RUE JEAN PIERRE CALLOC'H,0147,56250,56231,Saint-Nolff,56,,,56231000AA0042,,,,,,,,,,,,,0,1,Maison,103,6,S,sols,,,598,-2.65684,47.704839
2023-723977,2023-12-01,000001,Vente,355000,5551,,LOT DE TOULGRAND,B881,56250,56231,Saint-Nolff,56,,,56231000AN0005,,,,,,,,,,,,,0,1,Maison,102,5,S,sols,,,778,-2.658518,47.696689
2023-724133,2023-11-24,000001,Vente,54002,5296,,DILLIEC,B260,56250,56231,Saint-Nolff,56,,,56231000AI0132,,,,,,,,,,,,,0,1,Maison,100,5,S,sols,,,555,-2.682357,47.68573
2023-724400,2023-12-18,000002,Vente,70000,,,BEL ORIENT,B020,56250,56231,Saint-Nolff,56,,,56231000AD0314,,,,,,,,,,,,,0,,,,,J,jardins,,,781,,