id_mutation,date_mutation,numero_disposition,nature_mutation,valeur_fonciere,adresse_numero,adresse_suffixe,adresse_nom_voie,adresse_code_voie,code_postal,code_commune,nom_commune,code_departement,ancien_code_commune,ancien_nom_commune,id_parcelle,ancien_id_parcelle,numero_volume,lot1_numero,lot1_surface_carrez,lot2_numero,lot2_surface_carrez,lot3_numero,lot3_surface_carrez,lot4_numero,lot4_surface_carrez,lot5_numero,lot5_surface_carrez,nombre_lots,code_type_local,type_local,surface_reelle_bati,nombre_pieces_principales,code_nature_culture,nature_culture,code_nature_culture_speciale,nature_culture_speciale,surface_terrain,longitude,latitude
2023-736333,2023-03-11,000001,Vente,80000,3,,LES BUCHENOTS,B013,58270,58031,Billy-Chevannes,58,,,58031000ZE0103,,,,,,,,,,,,,0,1,Maison,101,4,S,sols,,,1333,3.470164,47.010568
2023-737124,2023-05-02,000001,Vente,16515,,,LE CREUSIL,B058,58270,58031,Billy-Chevannes,58,,,580310000D0207,,,,,,,,,,,,,0,,,,,T,terres,,,2275,3.475473,47.000028
2023-737124,2023-05-02,000001,Vente,16515,,,CHAMPS DUINOT,B026,58270,58031,Billy-Chevannes,58,,,58031000ZC0023,,,,,,,,,,,,,0,,,,,T,terres,,,54890,3.491443,47.013871
2023-737124,2023-05-02,000001,Vente,16515,,,LES BARDIAUX,B002,58270,58031,Billy-Chevannes,58,,,58031000ZD0011,,,,,,,,,,,,,0,,,,,T,terres,,,17580,3.473327,47.001109
2023-737124,2023-05-02,000001,Vente,16515,,,LES BARDIAUX,B002,58270,58031,Billy-Chevannes,58,,,58031000ZD0013,,,,,,,,,,,,,0,,,,,T,terres,,,7830,3.472708,47.000749
2023-737346,2023-05-23,000001,Vente,200000,,,EN COUTARD,B056,58270,58031,Billy-Chevannes,58,,,58031000AE0007,,,,,,,,,,,,,0,,,,,P,prés,,,66960,3.436001,47.032692
2023-737346,2023-05-23,000001,Vente,200000,,,EN COUTARD,B056,58270,58031,Billy-Chevannes,58,,,58031000AE0008,,,,,,,,,,,,,0,,,,,P,prés,,,63825,3.438679,47.032448
2023-737346,2023-05-23,000001,Vente,200000,,,PRES DE L ETANG,B123,58270,58031,Billy-Chevannes,58,,,58031000AE0009,,,,,,,,,,,,,0,,,,,P,prés,,,14740,3.437914,47.034155
2023-737346,2023-05-23,000001,Vente,200000,,,PRES DE L ETANG,B123,58270,58031,Billy-Chevannes,58,,,58031000AE0010,,,,,,,,,,,,,0,,,,,P,prés,,,8595,3.440549,47.0342
2023-737346,2023-05-23,000001,Vente,200000,,,CHAMP PAGENOT,B028,58270,58031,Billy-Chevannes,58,,,58031000AE0011,,,,,,,,,,,,,0,,,,,T,terres,,,30020,3.442896,47.033131
2023-737346,2023-05-23,000001,Vente,200000,,,CHAMP PAGENOT,B028,58270,58031,Billy-Chevannes,58,,,58031000AE0011,,,,,,,,,,,,,0,,,,,T,terres,,,30020,3.442896,47.033131
2023-737346,2023-05-23,000001,Vente,200000,,,SEMELIN,B138,58270,58031,Billy-Chevannes,58,,,58031000AE0023,,,,,,,,,,,,,0,,,,,BS,taillis sous futaie,,,665,3.439148,47.031691
2023-737726,2023-06-19,000001,Vente,36000,5,,RUE DE NANTEUIL,0007,58270,58031,Billy-Chevannes,58,,,58031000AA0011,,,,,,,,,,,,,0,1,Maison,75,2,S,sols,,,788,3.467897,47.008917
2023-737726,2023-06-19,000001,Vente,36000,,,NANTEUIL,B096,58270,58031,Billy-Chevannes,58,,,58031000AA0012,,,,,,,,,,,,,0,,,,,S,sols,,,388,3.468139,47.008943
2023-737726,2023-06-19,000001,Vente,36000,120,,NANTEUIL,B096,58270,58031,Billy-Chevannes,58,,,58031000AA0013,,,,,,,,,,,,,0,1,Maison,72,3,S,sols,,,106,3.468213,47.008901
2023-737726,2023-06-19,000001,Vente,36000,,,NANTEUIL,B096,58270,58031,Billy-Chevannes,58,,,58031000AA0015,,,,,,,,,,,,,0,,,,,S,sols,,,879,3.468437,47.008855
2023-737726,2023-06-19,000001,Vente,36000,,,NANTEUIL,B096,58270,58031,Billy-Chevannes,58,,,58031000AA0016,,,,,,,,,,,,,0,,,,,L,landes,,,193,3.468537,47.008695
2023-737726,2023-06-19,000001,Vente,36000,,,NANTEUIL,B096,58270,58031,Billy-Chevannes,58,,,58031000AA0017,,,,,,,,,,,,,0,,,,,S,sols,,,347,3.467999,47.00881
2023-737726,2023-06-19,000001,Vente,36000,,,NANTEUIL,B096,58270,58031,Billy-Chevannes,58,,,58031000AA0019,,,,,,,,,,,,,0,,,,,L,landes,,,131,3.468643,47.008615
2023-737726,2023-06-19,000001,Vente,36000,,,NANTEUIL,B096,58270,58031,Billy-Chevannes,58,,,58031000AA0083,,,,,,,,,,,,,0,,,,,P,prés,,,2296,3.466701,47.009076
2023-737726,2023-06-19,000001,Vente,36000,,,NANTEUIL,B096,58270,58031,Billy-Chevannes,58,,,58031000AA0092,,,,,,,,,,,,,0,,,,,P,prés,,,4390,3.469082,47.008762
2023-737726,2023-06-19,000001,Vente,36000,,,NANTEUIL,B096,58270,58031,Billy-Chevannes,58,,,58031000AA0119,,,,,,,,,,,,,0,,,,,P,prés,,,5960,3.469079,47.009285
2023-737949,2023-07-06,000001,Vente,187000,,,CHEVANNES,B049,58270,58031,Billy-Chevannes,58,,,58031000AH0004,,,,,,,,,,,,,0,,,,,T,terres,,,4479,3.474648,47.022795
2023-737949,2023-07-06,000001,Vente,187000,39,,CHEVANNES,B049,58270,58031,Billy-Chevannes,58,,,58031000AH0005,,,,,,,,,,,,,0,3,Dépendance,,0,P,prés,,,2875,3.47539,47.022893
2023-737949,2023-07-06,000001,Vente,187000,1,,RUE DE L'EGLISE,0004,58270,58031,Billy-Chevannes,58,,,58031000AH0006,,,,,,,,,,,,,0,3,Dépendance,,0,S,sols,,,1365,3.475747,47.022754
2023-737949,2023-07-06,000001,Vente,187000,1,,RUE DE L'EGLISE,0004,58270,58031,Billy-Chevannes,58,,,58031000AH0006,,,,,,,,,,,,,0,1,Maison,130,6,S,sols,,,1365,3.475747,47.022754
2023-737949,2023-07-06,000001,Vente,187000,,,CHEVANNES,B049,58270,58031,Billy-Chevannes,58,,,58031000ZH0016,,,,,,,,,,,,,0,,,,,P,prés,,,110,3.474078,47.022827
2023-737949,2023-07-06,000001,Vente,187000,,,CHEVANNES,B049,58270,58031,Billy-Chevannes,58,,,58031000ZH0097,,,,,,,,,,,,,0,,,,,P,prés,,,9434,3.472667,47.022809
2023-738464,2023-07-31,000001,Vente,137000,,,SEMELIN,B138,58270,58031,Billy-Chevannes,58,,,58031000AE0083,,,,,,,,,,,,,0,,,,,S,sols,,,495,3.441991,47.029319
2023-738464,2023-07-31,000001,Vente,137000,,,SEMELIN,B138,58270,58031,Billy-Chevannes,58,,,58031000AE0084,,,,,,,,,,,,,0,,,,,S,sols,,,163,3.442229,47.029345
2023-738464,2023-07-31,000001,Vente,137000,,,SEMELIN,B138,58270,58031,Billy-Chevannes,58,,,58031000AE0086,,,,,,,,,,,,,0,,,,,S,sols,,,262,3.441972,47.029115
2023-738464,2023-07-31,000001,Vente,137000,1,,SEMELIN DESSUS,A015,58270,58031,Billy-Chevannes,58,,,58031000AE0087,,,,,,,,,,,,,0,3,Dépendance,,0,S,sols,,,1410,3.441765,47.029039
2023-738464,2023-07-31,000001,Vente,137000,1,,SEMELIN DESSUS,A015,58270,58031,Billy-Chevannes,58,,,58031000AE0087,,,,,,,,,,,,,0,1,Maison,107,4,S,sols,,,1410,3.441765,47.029039
2023-738464,2023-07-31,000001,Vente,137000,1,,SEMELIN DESSUS,A015,58270,58031,Billy-Chevannes,58,,,58031000AE0087,,,,,,,,,,,,,0,3,Dépendance,,0,S,sols,,,1410,3.441765,47.029039
2023-738464,2023-07-31,000001,Vente,137000,,,SEMELIN,B138,58270,58031,Billy-Chevannes,58,,,58031000AE0088,,,,,,,,,,,,,0,,,,,J,jardins,,,391,3.441545,47.029302
2023-738464,2023-07-31,000001,Vente,137000,,,SEMELIN,B138,58270,58031,Billy-Chevannes,58,,,58031000AE0089,,,,,,,,,,,,,0,,,,,S,sols,,,130,3.441796,47.029308
2023-738464,2023-07-31,000001,Vente,137000,,,SEMELIN,B138,58270,58031,Billy-Chevannes,58,,,58031000AE0091,,,,,,,,,,,,,0,,,,,J,jardins,,,669,3.441715,47.029449
2023-738464,2023-07-31,000001,Vente,137000,15,,SEMELIN,B138,58270,58031,Billy-Chevannes,58,,,58031000AE0092,,,,,,,,,,,,,0,1,Maison,43,2,S,sols,,,240,3.442122,47.029481
2023-738464,2023-07-31,000001,Vente,137000,,,SEMELIN,B138,58270,58031,Billy-Chevannes,58,,,58031000AE0093,,,,,,,,,,,,,0,,,,,J,jardins,,,158,3.44224,47.029623
2023-738464,2023-07-31,000001,Vente,137000,,,SEMELIN,B138,58270,58031,Billy-Chevannes,58,,,58031000AE0094,,,,,,,,,,,,,0,,,,,S,sols,,,45,3.442269,47.029675
2023-738784,2023-08-01,000001,Vente,57075,,,CHAMPS DE CHARRIS,B031,58270,58031,Billy-Chevannes,58,,,58031000ZB0072,,,,,,,,,,,,,0,,,,,T,terres,,,2520,3.481799,47.033842
2023-738784,2023-08-01,000001,Vente,57075,,,CHAMPS DE CHARRIS,B031,58270,58031,Billy-Chevannes,58,,,58031000ZB0073,,,,,,,,,,,,,0,,,,,T,terres,,,1180,3.482252,47.033825
2023-738784,2023-08-01,000001,Vente,57075,,,CHAMPS DE CHARRIS,B031,58270,58031,Billy-Chevannes,58,,,58031000ZB0074,,,,,,,,,,,,,0,,,,,T,terres,,,4320,3.482896,47.034035
2023-739091,2023-09-13,000001,Vente,300000,,,VAUDENIN,B145,58270,58031,Billy-Chevannes,58,,,580310000A0107,,,,,,,,,,,,,0,,,,,BS,taillis sous futaie,,,96560,3.457692,47.031253
2023-739091,2023-09-13,000001,Vente,300000,,,LA CHATAIGNERIE,B045,58270,58031,Billy-Chevannes,58,,,580310000B0001,,,,,,,,,,,,,0,,,,,BF,futaies feuillues,,,299120,3.463263,47.032056
2023-739233,2023-09-21,000001,Vente,26000,,,CHEVANNES,B049,58270,58031,Billy-Chevannes,58,,,58031000AH0055,,,,,,,,,,,,,0,,,,,S,sols,,,366,3.479524,47.02236
2023-739233,2023-09-21,000001,Vente,26000,,,CHEVANNES,B049,58270,58031,Billy-Chevannes,58,,,58031000AH0161,,,,,,,,,,,,,0,,,,,P,prés,,,1042,3.479678,47.022868
2023-739678,2023-10-06,000001,Vente,132020,,,PATRY,B103,58270,58031,Billy-Chevannes,58,,,580310000A0260,,,,,,,,,,,,,0,,,,,P,prés,,,956,3.459945,47.025436
2023-739678,2023-10-06,000001,Vente,132020,1,,IMP DE LA SOURCE,0006,58270,58031,Billy-Chevannes,58,,,580310000A0261,,,,,,,,,,,,,0,1,Maison,103,6,S,sols,,,734,3.459987,47.025171
2023-739678,2023-10-06,000001,Vente,132020,,,PATRY,B103,58270,58031,Billy-Chevannes,58,,,580310000A0280,,,,,,,,,,,,,0,,,,,P,prés,,,1116,3.459711,47.025385
2023-739889,2023-11-07,000001,Vente,135000,,,BOIS RETIF,B006,58270,58031,Billy-Chevannes,58,,,58031000ZA0006,,,,,,,,,,,,,0,,,,,P,prés,,,6595,3.476986,47.030165
2023-739889,2023-11-07,000001,Vente,135000,,,BOIS RETIF,B006,58270,58031,Billy-Chevannes,58,,,58031000ZA0006,,,,,,,,,,,,,0,,,,,P,prés,,,6595,3.476986,47.030165
2023-739889,2023-11-07,000001,Vente,135000,7,,BOIS RETIF,B006,58270,58031,Billy-Chevannes,58,,,58031000ZA0007,,,,,,,,,,,,,0,1,Maison,98,5,S,sols,,,933,3.477109,47.029613
2023-740716,2023-12-11,000001,Vente,155000,1,A,SEMELIN DESSOUS,A014,58270,58031,Billy-Chevannes,58,,,58031000AD0027,,,,,,,,,,,,,0,1,Maison,28,1,P,prés,,,25666,3.438829,47.024309
2023-740716,2023-12-11,000001,Vente,155000,1,A,SEMELIN DESSOUS,A014,58270,58031,Billy-Chevannes,58,,,58031000AD0027,,,,,,,,,,,,,0,1,Maison,28,1,E,eaux,MARE,Mare,18290,3.438829,47.024309
2023-740716,2023-12-11,000001,Vente,155000,,,PRE DE LA MAISON,B110,58270,58031,Billy-Chevannes,58,,,58031000AD0028,,,,,,,,,,,,,0,,,,,P,prés,,,568,3.439649,47.025319
2023-740716,2023-12-11,000001,Vente,155000,,,PRE DE LA MAISON,B110,58270,58031,Billy-Chevannes,58,,,58031000AD0028,,,,,,,,,,,,,0,,,,,P,prés,,,568,3.439649,47.025319
