id_mutation,date_mutation,numero_disposition,nature_mutation,valeur_fonciere,adresse_numero,adresse_suffixe,adresse_nom_voie,adresse_code_voie,code_postal,code_commune,nom_commune,code_departement,ancien_code_commune,ancien_nom_commune,id_parcelle,ancien_id_parcelle,numero_volume,lot1_numero,lot1_surface_carrez,lot2_numero,lot2_surface_carrez,lot3_numero,lot3_surface_carrez,lot4_numero,lot4_surface_carrez,lot5_numero,lot5_surface_carrez,nombre_lots,code_type_local,type_local,surface_reelle_bati,nombre_pieces_principales,code_nature_culture,nature_culture,code_nature_culture_speciale,nature_culture_speciale,surface_terrain,longitude,latitude
2023-735228,2023-01-17,000001,Vente,78000,7,,RTE DU BAZOIS,0016,58110,58107,Dun-sur-Grandry,58,,,581070000C0294,,,,,,,,,,,,,0,1,Maison,80,3,S,sols,,,734,3.790044,47.084689
2023-735974,2023-02-23,000001,Vente,39500,9,,CHE DES HUTTES,0012,58110,58107,Dun-sur-Grandry,58,,,581070000A0246,,,,,,,,,,,,,0,1,Maison,66,3,S,sols,,,937,3.808048,47.096355
2023-735974,2023-02-23,000001,Vente,39500,,,LES HUTTES,B054,58110,58107,Dun-sur-Grandry,58,,,581070000A0543,,,,,,,,,,,,,0,,,,,P,prés,,,1547,3.807832,47.09656
2023-736080,2023-02-20,000001,Vente,800,,,CHAMPAUSSERIN,B019,58110,58107,Dun-sur-Grandry,58,,,58107000ZE0010,,,,,,,,,,,,,0,,,,,P,prés,,,2675,3.788719,47.074681
2023-737423,2023-05-31,000001,Vente,90000,33,,RTE DU VEYNON,0021,58110,58107,Dun-sur-Grandry,58,,,581070000A0232,,,,,,,,,,,,,0,3,Dépendance,,0,S,sols,,,285,3.806395,47.095571
2023-737423,2023-05-31,000001,Vente,90000,33,,RTE DU VEYNON,0021,58110,58107,Dun-sur-Grandry,58,,,581070000A0232,,,,,,,,,,,,,0,1,Maison,58,3,S,sols,,,285,3.806395,47.095571
2023-737423,2023-05-31,000001,Vente,90000,,,GRANDRY,B049,58110,58107,Dun-sur-Grandry,58,,,581070000A0233,,,,,,,,,,,,,0,,,,,J,jardins,,,810,3.806479,47.095733
2023-737423,2023-05-31,000001,Vente,90000,,,GRANDRY,B049,58110,58107,Dun-sur-Grandry,58,,,581070000A0234,,,,,,,,,,,,,0,,,,,J,jardins,,,265,3.806679,47.095589
2023-737781,2023-06-27,000001,Vente,13000,,,LA MONTAGNE,B060,58110,58107,Dun-sur-Grandry,58,,,581070000C0642,,,,,,,,,,,,,0,,,,,BT,taillis simples,,,63873,3.783015,47.092467
2023-737829,2023-06-07,000001,Vente,21250,42,,LE BOURG,B004,58110,58107,Dun-sur-Grandry,58,,,581070000C0304,,,,,,,,,,,,,0,3,Dépendance,,0,S,sols,,,123,3.789592,47.085332
2023-737829,2023-06-07,000001,Vente,21250,42,,LE BOURG,B004,58110,58107,Dun-sur-Grandry,58,,,581070000C0304,,,,,,,,,,,,,0,1,Maison,65,3,S,sols,,,123,3.789592,47.085332
2023-737829,2023-06-07,000001,Vente,21250,,,LE BOURG,B004,58110,58107,Dun-sur-Grandry,58,,,581070000C0305,,,,,,,,,,,,,0,,,,,J,jardins,,,500,3.789454,47.085392
2023-738774,2023-08-04,000001,Vente,192500,12,,RTE DU VEYNON,0021,58110,58107,Dun-sur-Grandry,58,,,581070000A0113,,,,,,,,,,,,,0,1,Maison,152,5,S,sols,,,390,3.804359,47.095607
2023-738774,2023-08-04,000001,Vente,192500,,,GRANDRY,B049,58110,58107,Dun-sur-Grandry,58,,,581070000A0115,,,,,,,,,,,,,0,,,,,P,prés,,,2675,3.804126,47.095361
2023-738774,2023-08-04,000001,Vente,192500,,,GRANDRY,B049,58110,58107,Dun-sur-Grandry,58,,,581070000A0487,,,,,,,,,,,,,0,,,,,J,jardins,,,528,3.804676,47.095448
2023-738915,2023-09-06,000001,Vente,60000,7,,RTE DE LA VALLEE,0008,58110,58107,Dun-sur-Grandry,58,,,581070000B0148,,,,,,,,,,,,,0,1,Maison,100,4,S,sols,,,333,3.797197,47.090741
2023-738915,2023-09-06,000001,Vente,60000,7,,RTE DE LA VALLEE,0008,58110,58107,Dun-sur-Grandry,58,,,581070000B0148,,,,,,,,,,,,,0,3,Dépendance,,0,S,sols,,,333,3.797197,47.090741
2023-738915,2023-09-06,000001,Vente,60000,9004,,VERPOUX,B094,58110,58107,Dun-sur-Grandry,58,,,58107000ZK0099,,,,,,,,,,,,,0,3,Dépendance,,0,S,sols,,,147,3.79731,47.090615
2023-739534,2023-10-12,000001,Vente,18000,,,CREUSEVERNE,B033,58110,58107,Dun-sur-Grandry,58,,,581070000B0591,,,,,,,,,,,,,0,,,,,S,sols,,,275,3.802934,47.081521
2023-739534,2023-10-12,000001,Vente,18000,,,CREUSEVERNE,B033,58110,58107,Dun-sur-Grandry,58,,,581070000B0780,,,,,,,,,,,,,0,,,,,S,sols,,,101,3.80307,47.081486
2023-739534,2023-10-12,000001,Vente,18000,,,LES OUCHES,B069,58110,58107,Dun-sur-Grandry,58,,,58107000ZD0077,,,,,,,,,,,,,0,,,,,P,prés,,,494,3.80335,47.081476
2023-739926,2023-10-31,000001,Vente,300,105,,CREUSEVERNE,B033,58110,58107,Dun-sur-Grandry,58,,,581070000B0587,,,,,,,,,,,,,0,3,Dépendance,,0,S,sols,,,55,3.802618,47.081286
2023-740148,2023-11-22,000001,Vente,36250,30,,RTE DE SAINT-PEREUSE,0009,58110,58107,Dun-sur-Grandry,58,,,58107000ZD0069,,,,,,,,,,,,,0,1,Maison,115,6,S,sols,,,650,3.806244,47.080615
2023-740148,2023-11-22,000001,Vente,36250,,,LA CROIX MISTERET,B035,58110,58107,Dun-sur-Grandry,58,,,58107000ZD0071,,,,,,,,,,,,,0,,,,,P,prés,,,562,3.806186,47.08056
2023-740379,2023-10-20,000001,Vente,109650,,,LES BRAULTS,B007,58110,58107,Dun-sur-Grandry,58,,,58107000ZB0039,,,,,,,,,,,,,0,,,,,T,terres,,,1085,3.808652,47.094297
2023-740379,2023-10-20,000001,Vente,109650,47,,RTE DU VEYNON,0021,58110,58107,Dun-sur-Grandry,58,,,58107000ZB0040,,,,,,,,,,,,,0,1,Maison,86,4,S,sols,,,510,3.808388,47.09448
2023-740379,2023-10-20,000001,Vente,109650,176,,LES BRAULTS,B007,58110,58107,Dun-sur-Grandry,58,,,58107000ZB0043,,,,,,,,,,,,,0,1,Maison,51,3,S,sols,,,75,3.808442,47.094287
2023-740379,2023-10-20,000001,Vente,109650,,,LES BRAULTS,B007,58110,58107,Dun-sur-Grandry,58,,,58107000ZB0053,,,,,,,,,,,,,0,,,,,L,landes,,,49,3.808492,47.09419
