id_mutation,date_mutation,numero_disposition,nature_mutation,valeur_fonciere,adresse_numero,adresse_suffixe,adresse_nom_voie,adresse_code_voie,code_postal,code_commune,nom_commune,code_departement,ancien_code_commune,ancien_nom_commune,id_parcelle,ancien_id_parcelle,numero_volume,lot1_numero,lot1_surface_carrez,lot2_numero,lot2_surface_carrez,lot3_numero,lot3_surface_carrez,lot4_numero,lot4_surface_carrez,lot5_numero,lot5_surface_carrez,nombre_lots,code_type_local,type_local,surface_reelle_bati,nombre_pieces_principales,code_nature_culture,nature_culture,code_nature_culture_speciale,nature_culture_speciale,surface_terrain,longitude,latitude
2023-770406,2023-01-05,000001,Vente,130000,85,,RTE D'ETROEUNGT,0051,59440,59093,Boulogne-sur-Helpe,59,,,590930000B0433,,,,,,,,,,,,,0,1,Maison,87,3,J,jardins,,,643,3.913743,50.076326
2023-770406,2023-01-05,000001,Vente,130000,85,,RTE D'ETROEUNGT,0051,59440,59093,Boulogne-sur-Helpe,59,,,590930000B0433,,,,,,,,,,,,,0,3,Dépendance,,0,J,jardins,,,643,3.913743,50.076326
2023-770406,2023-01-05,000001,Vente,130000,85,,RTE D'ETROEUNGT,0051,59440,59093,Boulogne-sur-Helpe,59,,,590930000B0433,,,,,,,,,,,,,0,1,Maison,87,3,PA,pâtures,PATUR,Pâture plantée,1223,3.913743,50.076326
2023-770406,2023-01-05,000001,Vente,130000,85,,RTE D'ETROEUNGT,0051,59440,59093,Boulogne-sur-Helpe,59,,,590930000B0433,,,,,,,,,,,,,0,3,Dépendance,,0,PA,pâtures,PATUR,Pâture plantée,1223,3.913743,50.076326
2023-770406,2023-01-05,000001,Vente,130000,85,,RTE D'ETROEUNGT,0051,59440,59093,Boulogne-sur-Helpe,59,,,590930000B0433,,,,,,,,,,,,,0,1,Maison,87,3,S,sols,,,656,3.913743,50.076326
2023-770406,2023-01-05,000001,Vente,130000,85,,RTE D'ETROEUNGT,0051,59440,59093,Boulogne-sur-Helpe,59,,,590930000B0433,,,,,,,,,,,,,0,3,Dépendance,,0,S,sols,,,656,3.913743,50.076326
2023-772391,2023-02-24,000001,Vente,5673,,,FOSSE LEGERE,B016,59440,59093,Boulogne-sur-Helpe,59,,,590930000B0105,,,,,,,,,,,,,0,,,,,PA,pâtures,PATUR,Pâture plantée,11346,3.910837,50.083458
2023-773948,2023-04-27,000001,Vente,120000,21,,RTE D'ETROEUNGT,0051,59440,59093,Boulogne-sur-Helpe,59,,,590930000B0321,,,,,,,,,,,,,0,3,Dépendance,,0,S,sols,,,601,3.899156,50.077849
2023-773948,2023-04-27,000001,Vente,120000,21,,RTE D'ETROEUNGT,0051,59440,59093,Boulogne-sur-Helpe,59,,,590930000B0321,,,,,,,,,,,,,0,3,Dépendance,,0,S,sols,,,601,3.899156,50.077849
2023-773948,2023-04-27,000001,Vente,120000,21,,RTE D'ETROEUNGT,0051,59440,59093,Boulogne-sur-Helpe,59,,,590930000B0321,,,,,,,,,,,,,0,1,Maison,111,4,S,sols,,,601,3.899156,50.077849
2023-773948,2023-04-27,000001,Vente,120000,21,,RTE D'ETROEUNGT,0051,59440,59093,Boulogne-sur-Helpe,59,,,590930000B0321,,,,,,,,,,,,,0,3,Dépendance,,0,S,sols,,,601,3.899156,50.077849
2023-773948,2023-04-27,000001,Vente,120000,,,LE VILLAGE,B049,59440,59093,Boulogne-sur-Helpe,59,,,590930000B0322,,,,,,,,,,,,,0,,,,,J,jardins,,,129,3.899231,50.077752
2023-774755,2023-05-16,000001,Echange,30016.8,,,LA ROUGE CROIX,B043,59440,59093,Boulogne-sur-Helpe,59,,,590930000C0094,,,,,,,,,,,,,0,,,,,PA,pâtures,PATUR,Pâture plantée,11715,3.879573,50.072587
2023-774755,2023-05-16,000001,Echange,30016.8,,,LA ROUGE CROIX,B043,59440,59093,Boulogne-sur-Helpe,59,,,590930000C0386,,,,,,,,,,,,,0,,,,,PA,pâtures,PATUR,Pâture plantée,7815,3.878208,50.0722
2023-774757,2023-05-16,000003,Echange,7402.45,,,LE PETIT CHAMP,B035,59440,59093,Boulogne-sur-Helpe,59,,,590930000C0053,,,,,,,,,,,,,0,,,,,PA,pâtures,PATUR,Pâture plantée,13459,3.880843,50.072351
2023-775871,2023-07-06,000001,Vente,155000,1,,RUE DE L'EGLISE,0050,59440,59093,Boulogne-sur-Helpe,59,,,590930000B0288,,,,,,,,,,,,,0,3,Dépendance,,0,S,sols,,,1053,3.895102,50.079651
2023-775871,2023-07-06,000001,Vente,155000,1,,RUE DE L'EGLISE,0050,59440,59093,Boulogne-sur-Helpe,59,,,590930000B0288,,,,,,,,,,,,,0,3,Dépendance,,0,S,sols,,,1053,3.895102,50.079651
2023-775871,2023-07-06,000001,Vente,155000,1,,RUE DE L'EGLISE,0050,59440,59093,Boulogne-sur-Helpe,59,,,590930000B0288,,,,,,,,,,,,,0,1,Maison,135,4,S,sols,,,1053,3.895102,50.079651
2023-775871,2023-07-06,000001,Vente,155000,1,,RUE DE L'EGLISE,0050,59440,59093,Boulogne-sur-Helpe,59,,,590930000B0288,,,,,,,,,,,,,0,3,Dépendance,,0,S,sols,,,1053,3.895102,50.079651
2023-775871,2023-07-06,000001,Vente,155000,,,LE VILLAGE,B049,59440,59093,Boulogne-sur-Helpe,59,,,590930000B0289,,,,,,,,,,,,,0,,,,,AG,terrains d'agrément,,,496,3.894841,50.079576
