id_mutation,date_mutation,numero_disposition,nature_mutation,valeur_fonciere,adresse_numero,adresse_suffixe,adresse_nom_voie,adresse_code_voie,code_postal,code_commune,nom_commune,code_departement,ancien_code_commune,ancien_nom_commune,id_parcelle,ancien_id_parcelle,numero_volume,lot1_numero,lot1_surface_carrez,lot2_numero,lot2_surface_carrez,lot3_numero,lot3_surface_carrez,lot4_numero,lot4_surface_carrez,lot5_numero,lot5_surface_carrez,nombre_lots,code_type_local,type_local,surface_reelle_bati,nombre_pieces_principales,code_nature_culture,nature_culture,code_nature_culture_speciale,nature_culture_speciale,surface_terrain,longitude,latitude
2023-741286,2023-01-06,000001,Vente,210000,,,RUE DE L ABBE LEMIRE,0010,59560,59152,Comines,59,,,59152000AH0101,,,,,,,,,,,,,0,,,,,S,sols,,,3,3.001438,50.763598
2023-741286,2023-01-06,000001,Vente,210000,6,,RUE DE L ABBE LEMIRE,0010,59560,59152,Comines,59,,,59152000AH0102,,,,,,,,,,,,,0,1,Maison,83,4,S,sols,,,297,3.001226,50.763766
2023-741335,2023-01-05,000001,Vente,185000,94,,RUE DE QUESNOY,0720,59560,59152,Comines,59,,,59152000AO0023,,,,,,,,,,,,,0,1,Maison,93,5,S,sols,,,109,3.002994,50.758106
2023-741564,2023-01-09,000001,Vente,12000,38,T,RUE D HURLUPIN,0450,59560,59152,Comines,59,,,59152000AH0439,,,,,,,,,,,,,0,3,Dépendance,,0,S,sols,,,14,3.008286,50.764273
2023-741567,2023-01-13,000001,Vente,225000,1,,RUE DE LA REPUBLIQUE,0730,59560,59152,Comines,59,,,59152000AH0376,,,1,110,4,,,,,,,,2,4,Local industriel. commercial ou assimilé,152,0,,,,,,3.006643,50.764727
2023-741570,2023-01-12,000001,Vente,220000,41,,RUE DU HOCCART,0440,59560,59152,Comines,59,,,59152000AH0651,,,,,,,,,,,,,0,1,Maison,90,4,S,sols,,,137,3.004408,50.762068
2023-741570,2023-01-12,000001,Vente,220000,41,,RUE DU HOCCART,0440,59560,59152,Comines,59,,,59152000AH0651,,,,,,,,,,,,,0,3,Dépendance,,0,S,sols,,,137,3.004408,50.762068
2023-741571,2023-01-11,000001,Vente,14000,38,B,RUE D HURLUPIN,0450,59560,59152,Comines,59,,,59152000AH0425,,,,,,,,,,,,,0,3,Dépendance,,0,S,sols,,,14,3.007944,50.764159
2023-741571,2023-01-11,000001,Vente,14000,38,B,RUE D HURLUPIN,0450,59560,59152,Comines,59,,,59152000AH0433,,,,,,,,,,,,,0,,,,,S,sols,,,230,3.00793,50.764231
2023-741578,2023-01-09,000001,Vente,218000,10,,RUE DU CHEVRON D OR,0200,59560,59152,Comines,59,,,59152000AR0006,,,,,,,,,,,,,0,3,Dépendance,,0,S,sols,,,274,2.993419,50.75782
2023-741578,2023-01-09,000001,Vente,218000,10,,RUE DU CHEVRON D OR,0200,59560,59152,Comines,59,,,59152000AR0006,,,,,,,,,,,,,0,1,Maison,65,4,S,sols,,,274,2.993419,50.75782
2023-742370,2023-01-17,000001,Vente,185700,32,,RUE DES FRERES BULKAEN,0320,59560,59152,Comines,59,,,59152000AT0073,,,,,,,,,,,,,0,1,Maison,96,4,S,sols,,,339,3.009405,50.740301
2023-742370,2023-01-17,000001,Vente,185700,32,,RUE DES FRERES BULKAEN,0320,59560,59152,Comines,59,,,59152000AT0073,,,,,,,,,,,,,0,3,Dépendance,,0,S,sols,,,339,3.009405,50.740301
2023-742373,2023-01-05,000001,Vente,245000,35,,RUE PIERRE MENDES FRANCE,0672,59560,59152,Comines,59,,,59152000AO0310,,,,,,,,,,,,,0,1,Maison,90,4,S,sols,,,204,3.002818,50.75527
2023-742521,2023-02-07,000001,Vente,446600,15,,RUE DES CHATAIGNIERS,0188,59560,59152,Comines,59,,,59152000AR0078,,,,,,,,,,,,,0,1,Maison,148,6,S,sols,,,599,2.998463,50.755986
2023-742646,2023-01-27,000001,Vente,139700,9,,RUE NOTRE DAME,0610,59560,59152,Comines,59,,,59152000AH0841,,,,,,,,,,,,,0,1,Maison,95,5,S,sols,,,99,3.001867,50.761338
2023-742646,2023-01-27,000001,Vente,139700,9,,RUE NOTRE DAME,0610,59560,59152,Comines,59,,,59152000AH0841,,,,,,,,,,,,,0,3,Dépendance,,0,S,sols,,,99,3.001867,50.761338
2023-742649,2023-01-20,000001,Vente,110070,1,,CHE DU MOULIN,0580,59560,59152,Comines,59,,,59152000AK0760,,,114,48.76,,,,,,,,,1,2,Appartement,48,2,,,,,,3.008843,50.760522
2023-742649,2023-01-20,000001,Vente,110070,1,,CHE DU MOULIN,0580,59560,59152,Comines,59,,,59152000AK0760,,,16,11,,,,,,,,,1,3,Dépendance,,0,,,,,,3.008843,50.760522
2023-742667,2023-02-06,000001,Vente,205000,19,,RUE DE LA REPUBLIQUE,0730,59560,59152,Comines,59,,,59152000AH0383,,,,,,,,,,,,,0,4,Local industriel. commercial ou assimilé,140,0,S,sols,,,151,3.005287,50.764109
2023-742667,2023-02-06,000001,Vente,205000,19,,RUE DE LA REPUBLIQUE,0730,59560,59152,Comines,59,,,59152000AH0383,,,,,,,,,,,,,0,1,Maison,56,3,S,sols,,,151,3.005287,50.764109
2023-743220,2023-02-16,000001,Vente,122500,95,,RUE DE QUESNOY,0720,59560,59152,Comines,59,,,59152000AM0461,,,,,,,,,,,,,0,3,Dépendance,,0,S,sols,,,151,3.003435,50.758585
2023-743220,2023-02-16,000001,Vente,122500,95,,RUE DE QUESNOY,0720,59560,59152,Comines,59,,,59152000AM0461,,,,,,,,,,,,,0,3,Dépendance,,0,S,sols,,,151,3.003435,50.758585
2023-743220,2023-02-16,000001,Vente,122500,95,,RUE DE QUESNOY,0720,59560,59152,Comines,59,,,59152000AM0461,,,,,,,,,,,,,0,3,Dépendance,,0,S,sols,,,151,3.003435,50.758585
2023-743220,2023-02-16,000001,Vente,122500,95,,RUE DE QUESNOY,0720,59560,59152,Comines,59,,,59152000AM0461,,,,,,,,,,,,,0,2,Appartement,50,2,S,sols,,,151,3.003435,50.758585
2023-743220,2023-02-16,000001,Vente,122500,95,,RUE DE QUESNOY,0720,59560,59152,Comines,59,,,59152000AM0461,,,,,,,,,,,,,0,2,Appartement,50,2,S,sols,,,151,3.003435,50.758585
2023-743220,2023-02-16,000001,Vente,122500,95,,RUE DE QUESNOY,0720,59560,59152,Comines,59,,,59152000AM0461,,,,,,,,,,,,,0,2,Appartement,40,2,S,sols,,,151,3.003435,50.758585
2023-743269,2023-02-10,000001,Vente,745092,,,LA GAIE PERCHE,B052,59560,59152,Comines,59,,,59152000AW0038,,,,,,,,,,,,,0,,,,,AB,terrains a bâtir,,,20697,3.002136,50.752088
2023-743281,2023-02-01,000001,Vente,202950,5,,RUE PHILIPPE DE COMINES,0647,59560,59152,Comines,59,,,59152000AM0302,,,,,,,,,,,,,0,1,Maison,85,3,S,sols,,,198,3.007396,50.756546
2023-743291,2023-02-10,000001,Vente en l'état futur d'achèvement,245000,7,,RUE DU VIEIL DIEU,0910,59560,59152,Comines,59,,,59152000AI0519,,,109,,,,,,,,,,1,,,,,,,,,,3.012459,50.761536
2023-743291,2023-02-10,000001,Vente en l'état futur d'achèvement,245000,7,,RUE DU VIEIL DIEU,0910,59560,59152,Comines,59,,,59152000AI0519,,,7,,,,,,,,,,1,,,,,,,,,,3.012459,50.761536
2023-743291,2023-02-10,000001,Vente en l'état futur d'achèvement,245000,7,,RUE DU VIEIL DIEU,0910,59560,59152,Comines,59,,,59152000AI0519,,,37,,,,,,,,,,1,,,,,,,,,,3.012459,50.761536
2023-743330,2023-01-30,000001,Vente,8788,,,DEVANT LA FERME DELPORTE,B015,59560,59152,Comines,59,,,59152000ZM0004,,,,,,,,,,,,,0,,,,,T,terres,,,7057,3.01815,50.748676
2023-743330,2023-01-30,000001,Vente,8788,,,DEVANT LA FERME DELPORTE,B015,59560,59152,Comines,59,,,59152000ZM0005,,,,,,,,,,,,,0,,,,,T,terres,,,1731,3.018561,50.74858
2023-743586,2023-02-03,000001,Vente,26782.2,,,CANTON DE LA FERME CARDON,B005,59560,59152,Comines,59,,,59152000ZD0002,,,,,,,,,,,,,0,,,,,T,terres,,,14031,3.016828,50.742095
2023-743586,2023-02-03,000001,Vente,26782.2,,,CANTON DE LA FERME CARDON,B005,59560,59152,Comines,59,,,59152000ZD0009,,,,,,,,,,,,,0,,,,,T,terres,,,9945,3.018724,50.738779
2023-743753,2023-02-16,000001,Vente,154900,47,,RUE DE FLANDRE,0290,59560,59152,Comines,59,,,59152000AM0485,,,,,,,,,,,,,0,1,Maison,125,4,S,sols,,,674,3.006279,50.755931
2023-743755,2023-02-17,000001,Vente,75000,140,,RUE GAMBETTA,0340,59560,59152,Comines,59,,,59152000AH0802,,,,,,,,,,,,,0,3,Dépendance,,0,S,sols,,,125,3.00391,50.760991
2023-743755,2023-02-17,000001,Vente,75000,140,,RUE GAMBETTA,0340,59560,59152,Comines,59,,,59152000AH0802,,,,,,,,,,,,,0,1,Maison,35,2,S,sols,,,125,3.00391,50.760991
2023-743755,2023-02-17,000001,Vente,75000,140,,RUE GAMBETTA,0340,59560,59152,Comines,59,,,59152000AH0803,,,,,,,,,,,,,0,,,,,S,sols,,,89,3.003828,50.760974
2023-743765,2023-02-14,000001,Vente,199520,25,,RUE SCHOUTTETEN,0780,59560,59152,Comines,59,,,59152000AK0592,,,,,,,,,,,,,0,1,Maison,67,4,S,sols,,,208,3.00737,50.760963
2023-743765,2023-02-14,000001,Vente,199520,25,,RUE SCHOUTTETEN,0780,59560,59152,Comines,59,,,59152000AK0592,,,,,,,,,,,,,0,3,Dépendance,,0,S,sols,,,208,3.00737,50.760963
2023-743778,2023-02-14,000001,Vente,258000,2,,PL JEAN DE LA CLYTE,0470,59560,59152,Comines,59,,,59152000AI0079,,,,,,,,,,,,,0,1,Maison,142,5,S,sols,,,403,3.015138,50.763011
2023-743882,2023-02-17,000002,Vente,26.4,,,CANTON DE LA FERME CARDON,B005,59560,59152,Comines,59,,,59152000ZD0144,,,,,,,,,,,,,0,,,,,PA,pâtures,,,33,3.024382,50.737735
2023-744190,2023-02-24,000001,Vente,268600,7,,RUE CORNEILLE,0214,59560,59152,Comines,59,,,59152000AO0238,,,,,,,,,,,,,0,1,Maison,102,4,S,sols,,,257,3.003953,50.75347
2023-744205,2023-02-23,000001,Vente,214000,91,,RUE DES PROCESSIONS,0690,59560,59152,Comines,59,,,59152000AK0737,,,,,,,,,,,,,0,3,Dépendance,,0,S,sols,,,191,3.008796,50.759777
2023-744205,2023-02-23,000001,Vente,214000,91,,RUE DES PROCESSIONS,0690,59560,59152,Comines,59,,,59152000AK0737,,,,,,,,,,,,,0,1,Maison,70,4,S,sols,,,191,3.008796,50.759777
2023-744334,2023-02-23,000001,Vente,435000,34,,RUE PAUL ELUARD,0642,59560,59152,Comines,59,,,59152000AV0019,,,,,,,,,,,,,0,1,Maison,126,5,S,sols,,,653,3.015322,50.740207
2023-744476,2023-02-27,000001,Vente,274800,100,,RUE GD PERNE AU VIEUX SOLDAT,0397,59560,59152,Comines,59,,,59152000ZE0073,,,,,,,,,,,,,0,1,Maison,90,5,S,sols,,,310,3.018747,50.730653
2023-745344,2023-03-14,000001,Vente,244000,17,,RUE DE L'ORCHIDEE,0622,59560,59152,Comines,59,,,59152000AC0540,,,,,,,,,,,,,0,1,Maison,98,5,S,sols,,,230,3.023912,50.766932
2023-745344,2023-03-14,000001,Vente,244000,,,RUE DE WERVICQ,0930,59560,59152,Comines,59,,,59152000AC0556,,,,,,,,,,,,,0,,,,,AB,terrains a bâtir,,,34,3.024074,50.766965
2023-745450,2023-03-20,000001,Vente,301500,17,,RUE JEAN DE LA FONTAINE,0466,59560,59152,Comines,59,,,59152000AN0401,,,,,,,,,,,,,0,1,Maison,80,4,S,sols,,,366,3.005978,50.752292
2023-745529,2023-03-10,000001,Vente,272150,97,,RUE DES TROIS BALLOTS,0850,59560,59152,Comines,59,,,59152000AE0182,,,,,,,,,,,,,0,1,Maison,142,4,S,sols,,,656,3.015825,50.764341
2023-745714,2023-03-21,000001,Vente,470000,280,,CHEM DU LONGCHAMP AU GAVRE,0532,59560,59152,Comines,59,,,59152000ZD0029,,,,,,,,,,,,,0,1,Maison,82,4,PA,pâtures,,,7899,3.032766,50.737615
2023-745714,2023-03-21,000001,Vente,470000,280,,CHEM DU LONGCHAMP AU GAVRE,0532,59560,59152,Comines,59,,,59152000ZD0029,,,,,,,,,,,,,0,1,Maison,82,4,S,sols,,,3859,3.032766,50.737615
2023-745714,2023-03-21,000001,Vente,470000,280,,CHEM DU LONGCHAMP AU GAVRE,0532,59560,59152,Comines,59,,,59152000ZD0029,,,,,,,,,,,,,0,1,Maison,82,4,PA,pâtures,,,3517,3.032766,50.737615
2023-745716,2023-03-24,000001,Vente,163000,5001,F,RUE BOIDIN,0141,59560,59152,Comines,59,,,59152000AH0919,,,21,,,,,,,,,,1,3,Dépendance,,0,,,,,,3.001894,50.761079
2023-745716,2023-03-24,000001,Vente,163000,9,,RUE BOIDIN,0141,59560,59152,Comines,59,,,59152000AH0919,,,302,60.84,,,,,,,,,1,4,Local industriel. commercial ou assimilé,64,0,,,,,,3.001894,50.761079
2023-745716,2023-03-24,000001,Vente,163000,5001,F,RUE BOIDIN,0141,59560,59152,Comines,59,,,59152000AH0919,,,22,,,,,,,,,,1,3,Dépendance,,0,,,,,,3.001894,50.761079
2023-745735,2023-03-24,000001,Vente,133100,41,,RUE DE LA REPUBLIQUE,0730,59560,59152,Comines,59,,,59152000AH0726,,,32,,,,,,,,,,1,3,Dépendance,,0,,,,,,3.004573,50.76323
2023-745735,2023-03-24,000001,Vente,133100,41,,RUE DE LA REPUBLIQUE,0730,59560,59152,Comines,59,,,59152000AH0726,,,104,46.9,,,,,,,,,1,2,Appartement,47,2,,,,,,3.004573,50.76323
2023-746086,2023-03-31,000001,Vente,425000,1,,RUE DE L ANCIENNE CITE,0050,59560,59152,Comines,59,,,59152000AN0075,,,,,,,,,,,,,0,1,Maison,174,5,S,sols,,,683,3.011103,50.755782
2023-746280,2023-03-17,000001,Vente,486050,2,T,RUE DU HOCCART,0440,59560,59152,Comines,59,,,59152000AH0939,,,,,,,,,,,,,0,3,Dépendance,,0,S,sols,,,645,3.005916,50.762826
2023-746280,2023-03-17,000001,Vente,486050,2,T,RUE DU HOCCART,0440,59560,59152,Comines,59,,,59152000AH0939,,,,,,,,,,,,,0,1,Maison,98,4,S,sols,,,645,3.005916,50.762826
2023-746280,2023-03-17,000001,Vente,486050,,,RUE DU HOCCART,0440,59560,59152,Comines,59,,,59152000AH0942,,,,,,,,,,,,,0,,,,,S,sols,,,23,3.005992,50.762638
2023-746473,2023-02-10,000001,Vente,126000,,,AV DE L ENERGIE,0260,59560,59152,Comines,59,,,59152000AC0003,,,,,,,,,,,,,0,,,,,T,terres,,,5529,3.019918,50.767008
2023-746490,2023-03-31,000001,Vente,228700,10,,RUE JEAN JAURES,0468,59560,59152,Comines,59,,,59152000AL0051,,,,,,,,,,,,,0,1,Maison,89,5,S,sols,,,394,3.021384,50.757897
2023-746583,2023-03-29,000002,Echange,500,59,,RUE DE LILLE,0510,59560,59152,Comines,59,,,59152000AT0150,,,,,,,,,,,,,0,,,,,S,sols,,,1,3.012778,50.741102
2023-746583,2023-03-29,000003,Echange,500,57,,RUE DE LILLE,0510,59560,59152,Comines,59,,,59152000AT0152,,,,,,,,,,,,,0,,,,,S,sols,,,1,3.012771,50.741083
2023-746783,2023-03-27,000001,Vente,110000,7,,RUE MARCEAU,0560,59560,59152,Comines,59,,,59152000AI0036,,,,,,,,,,,,,0,1,Maison,62,4,S,sols,,,140,3.013503,50.762969
2023-746898,2023-04-04,000001,Vente,104000,4,,RUE SCHOUTTETEN,0780,59560,59152,Comines,59,,,59152000AM0139,,,,,,,,,,,,,0,1,Maison,65,4,S,sols,,,230,3.006344,50.761129
2023-746898,2023-04-04,000001,Vente,104000,4,,RUE SCHOUTTETEN,0780,59560,59152,Comines,59,,,59152000AM0139,,,,,,,,,,,,,0,3,Dépendance,,0,S,sols,,,230,3.006344,50.761129
2023-746900,2023-04-12,000001,Vente,237000,27,,RUE CORNEILLE,0214,59560,59152,Comines,59,,,59152000AO0228,,,,,,,,,,,,,0,1,Maison,101,4,S,sols,,,281,3.00315,50.752806
2023-746983,2023-04-04,000001,Vente,290000,12,,RUE BASSE BRETAGNE,0110,59560,59152,Comines,59,,,59152000AH0259,,,,,,,,,,,,,0,3,Dépendance,,0,S,sols,,,352,3.002604,50.764291
2023-746983,2023-04-04,000001,Vente,290000,12,,RUE BASSE BRETAGNE,0110,59560,59152,Comines,59,,,59152000AH0259,,,,,,,,,,,,,0,1,Maison,232,6,S,sols,,,352,3.002604,50.764291
2023-746986,2023-04-13,000001,Vente,267270,9,,RUE DU PDT ALLENDE,0686,59560,59152,Comines,59,,,59152000AO0121,,,,,,,,,,,,,0,1,Maison,100,4,S,sols,,,208,3.005543,50.754596
2023-747075,2023-04-14,000002,Vente,6850,3,,RUE DE L ABBE LEMIRE,0010,59560,59152,Comines,59,,,59152000AH0996,,,,,,,,,,,,,0,,,,,S,sols,,,137,3.001718,50.763068
2023-747121,2023-04-14,000001,Vente,385000,3,,RUE PAUL LESAFFRE,0641,59560,59152,Comines,59,,,59152000AV0166,,,,,,,,,,,,,0,1,Maison,106,4,S,sols,,,738,3.01203,50.73925
2023-747125,2023-03-31,000001,Vente,452700,,,LE GAVRE,B022,59560,59152,Comines,59,,,59152000ZD0036,,,,,,,,,,,,,0,,,,,PA,pâtures,,,8384,3.03693,50.734269
2023-747125,2023-03-31,000001,Vente,452700,780,,CHEM DU LONGCHAMP AU GAVRE,0532,59560,59152,Comines,59,,,59152000ZD0107,,,,,,,,,,,,,0,1,Maison,124,6,S,sols,,,1652,3.037474,50.734365
2023-747376,2023-04-19,000001,Vente,300000,217,B,RUE DE WERVICQ,0930,59560,59152,Comines,59,,,59152000AA0030,,,,,,,,,,,,,0,4,Local industriel. commercial ou assimilé,2045,0,S,sols,,,3463,3.036457,50.769394
2023-747876,2023-04-26,000001,Vente,333000,62,,AV DU MARECHAL LECLERC,0370,59560,59152,Comines,59,,,59152000AK0027,,,,,,,,,,,,,0,1,Maison,122,5,S,sols,,,346,3.008006,50.761576
2023-747876,2023-04-26,000001,Vente,333000,71,,AV DU MARECHAL LECLERC,0370,59560,59152,Comines,59,,,59152000AK0072,,,,,,,,,,,,,0,3,Dépendance,,0,S,sols,,,13,3.00899,50.761583
2023-748193,2023-04-19,000001,Vente,160000,5,,PL JEAN DE LA CLYTE,0470,59560,59152,Comines,59,,,59152000AI0095,,,,,,,,,,,,,0,1,Maison,96,5,S,sols,,,333,3.015384,50.762707
2023-748213,2023-04-27,000001,Vente,210888,,,PARC ACTIVITES MAURICE SCHUMANN,A002,59560,59152,Comines,59,,,59152000AX0047,,,,,,,,,,,,,0,,,,,AB,terrains a bâtir,,,5858,2.991342,50.752992
2023-748216,2023-04-27,000001,Vente,402000,10,,RUE BASSE BRETAGNE,0110,59560,59152,Comines,59,,,59152000AH0260,,,,,,,,,,,,,0,1,Maison,237,8,S,sols,,,491,3.002765,50.764348
2023-748746,2023-05-11,000001,Vente en l'état futur d'achèvement,239285,7,,RUE DU VIEIL DIEU,0910,59560,59152,Comines,59,,,59152000AI0519,,,28,,,,,,,,,,1,2,Appartement,74,3,,,,,,3.012459,50.761536
2023-748746,2023-05-11,000001,Vente en l'état futur d'achèvement,239285,7,,RUE DU VIEIL DIEU,0910,59560,59152,Comines,59,,,59152000AI0519,,,111,,,,,,,,,,1,3,Dépendance,,0,,,,,,3.012459,50.761536
2023-748746,2023-05-11,000001,Vente en l'état futur d'achèvement,239285,7,,RUE DU VIEIL DIEU,0910,59560,59152,Comines,59,,,59152000AI0519,,,8,,,,,,,,,,1,,,,,,,,,,3.012459,50.761536
2023-748755,2023-04-21,000001,Vente,341100,34,,RUE GEORGES POMPIDOU,0385,59560,59152,Comines,59,,,59152000AN0210,,,,,,,,,,,,,0,1,Maison,115,5,S,sols,,,524,3.014128,50.75476
2023-749240,2023-05-17,000001,Vente,100000,87,,RUE D ARMENTIERES,0090,59560,59152,Comines,59,,,59152000AP0186,,,,,,,,,,,,,0,1,Maison,93,4,S,sols,,,126,2.995885,50.759073
2023-749240,2023-05-17,000001,Vente,100000,87,,RUE D ARMENTIERES,0090,59560,59152,Comines,59,,,59152000AP0186,,,,,,,,,,,,,0,3,Dépendance,,0,S,sols,,,126,2.995885,50.759073
2023-749520,2023-05-22,000001,Vente,234800,8,,RUE DU HUIT MAI,0446,59560,59152,Comines,59,,,59152000AN0414,,,,,,,,,,,,,0,1,Maison,124,4,S,sols,,,270,3.008481,50.754283
2023-749530,2023-05-24,000001,Vente,407000,5,,ALL LA BRUYERE,0483,59560,59152,Comines,59,,,59152000AI0051,,,,,,,,,,,,,0,1,Maison,113,4,S,sols,,,886,3.014622,50.762604
2023-749532,2023-05-17,000001,Vente,515000,6,,RUE DES CERISIERS,0163,59560,59152,Comines,59,,,59152000AP0074,,,,,,,,,,,,,0,1,Maison,189,6,S,sols,,,686,2.998244,50.75753
2023-749552,2023-05-17,000001,Vente,235000,138,,RUE DES TILLEULS,0816,59560,59152,Comines,59,,,59152000AR0101,,,,,,,,,,,,,0,1,Maison,102,4,S,sols,,,237,2.998112,50.754887
2023-749555,2023-05-22,000001,Vente,184970.4,57,,RUE GAMBETTA,0340,59560,59152,Comines,59,,,59152000AK0092,,,,,,,,,,,,,0,3,Dépendance,,0,S,sols,,,216,3.008581,50.761994
2023-749555,2023-05-22,000001,Vente,184970.4,57,,RUE GAMBETTA,0340,59560,59152,Comines,59,,,59152000AK0092,,,,,,,,,,,,,0,1,Maison,140,7,S,sols,,,216,3.008581,50.761994
2023-750158,2023-05-25,000001,Vente,90000,,,RUE DES FRERES LUMIERE,0321,59560,59152,Comines,59,,,59152000AX0015,,,,,,,,,,,,,0,,,,,AB,terrains a bâtir,,,74,2.99437,50.752939
2023-750158,2023-05-25,000001,Vente,90000,,,RUE DES FRERES LUMIERE,0321,59560,59152,Comines,59,,,59152000AX0017,,,,,,,,,,,,,0,,,,,S,sols,,,10,2.994373,50.752991
2023-750158,2023-05-25,000001,Vente,90000,11,,RUE RENE DESCARTES,0728,59560,59152,Comines,59,,,59152000AX0019,,,,,,,,,,,,,0,,,,,AB,terrains a bâtir,,,2119,2.994432,50.752876
2023-750182,2023-05-25,000001,Vente,385000,47,,RUE D ARMENTIERES,0090,59560,59152,Comines,59,,,59152000AP0373,,,,,,,,,,,,,0,,,,,S,sols,,,245,2.999068,50.759327
2023-750182,2023-05-25,000001,Vente,385000,47,B,RUE D ARMENTIERES,0090,59560,59152,Comines,59,,,59152000AP0374,,,,,,,,,,,,,0,2,Appartement,150,5,S,sols,,,1002,2.999212,50.759173
2023-750182,2023-05-25,000001,Vente,385000,47,B,RUE D ARMENTIERES,0090,59560,59152,Comines,59,,,59152000AP0374,,,,,,,,,,,,,0,2,Appartement,133,5,S,sols,,,1002,2.999212,50.759173
2023-750182,2023-05-25,000001,Vente,385000,47,B,RUE D ARMENTIERES,0090,59560,59152,Comines,59,,,59152000AP0374,,,,,,,,,,,,,0,3,Dépendance,,0,S,sols,,,1002,2.999212,50.759173
2023-750182,2023-05-25,000001,Vente,385000,47,B,RUE D ARMENTIERES,0090,59560,59152,Comines,59,,,59152000AP0374,,,,,,,,,,,,,0,3,Dépendance,,0,S,sols,,,1002,2.999212,50.759173
2023-750182,2023-05-25,000001,Vente,385000,47,B,RUE D ARMENTIERES,0090,59560,59152,Comines,59,,,59152000AP0374,,,,,,,,,,,,,0,3,Dépendance,,0,S,sols,,,1002,2.999212,50.759173
2023-750182,2023-05-25,000001,Vente,385000,47,B,RUE D ARMENTIERES,0090,59560,59152,Comines,59,,,59152000AP0374,,,,,,,,,,,,,0,3,Dépendance,,0,S,sols,,,1002,2.999212,50.759173
2023-750182,2023-05-25,000001,Vente,385000,47,B,RUE D ARMENTIERES,0090,59560,59152,Comines,59,,,59152000AP0374,,,,,,,,,,,,,0,2,Appartement,100,1,S,sols,,,1002,2.999212,50.759173
2023-750182,2023-05-25,000001,Vente,385000,,,RUE D ARMENTIERES,0090,59560,59152,Comines,59,,,59152000AP0380,,,,,,,,,,,,,0,,,,,S,sols,,,377,2.999117,50.759075
2023-750216,2023-06-07,000001,Vente,157000,9,,RUE DE LINSELLES,0520,59560,59152,Comines,59,,,59152000AI0017,,,,,,,,,,,,,0,1,Maison,70,4,S,sols,,,182,3.013326,50.762377
2023-750545,2023-06-01,000001,Vente,180000,102,,RUE DE WERVICQ,0930,59560,59152,Comines,59,,,59152000AC0332,,,,,,,,,,,,,0,1,Maison,102,4,S,sols,,,885,3.021694,50.764833
2023-750562,2023-06-06,000001,Vente,274000,90,,RUE DE LILLE,0510,59560,59152,Comines,59,,,59152000AV0154,,,,,,,,,,,,,0,3,Dépendance,,0,S,sols,,,527,3.013147,50.738807
2023-750562,2023-06-06,000001,Vente,274000,90,,RUE DE LILLE,0510,59560,59152,Comines,59,,,59152000AV0154,,,,,,,,,,,,,0,1,Maison,73,3,S,sols,,,527,3.013147,50.738807
2023-750565,2023-06-02,000001,Vente,167780,12,,RUE DE LA REPUBLIQUE,0730,59560,59152,Comines,59,,,59152000AH0322,,,2,112.38,,,,,,,,,1,1,Maison,104,4,,,,,,3.005343,50.764589
2023-750856,2023-06-13,000001,Vente,115400,,,RUE BLANCHE BANNIERE,0130,59560,59152,Comines,59,,,59152000AE0312,,,,,,,,,,,,,0,,,,,S,sols,,,14,3.016764,50.763419
2023-750856,2023-06-13,000001,Vente,115400,33,B,RUE BLANCHE BANNIERE,0130,59560,59152,Comines,59,,,59152000AE0317,,,,,,,,,,,,,0,1,Maison,55,3,S,sols,,,47,3.016542,50.763393
2023-750899,2023-06-22,000001,Vente,156000,7,,RUE DU BAS CHEMIN,0100,59560,59152,Comines,59,,,59152000AD0192,,,,,,,,,,,,,0,1,Maison,72,3,S,sols,,,67,3.009647,50.764738
2023-750998,2023-06-14,000001,Vente,180000,165,,RUE DE WERVICQ,0930,59560,59152,Comines,59,,,59152000AA0079,,,,,,,,,,,,,0,1,Maison,90,4,S,sols,,,217,3.027778,50.766986
2023-750998,2023-06-14,000001,Vente,180000,165,,RUE DE WERVICQ,0930,59560,59152,Comines,59,,,59152000AA0079,,,,,,,,,,,,,0,3,Dépendance,,0,S,sols,,,217,3.027778,50.766986
2023-750998,2023-06-14,000001,Vente,180000,165,,RUE DE WERVICQ,0930,59560,59152,Comines,59,,,59152000AA0079,,,,,,,,,,,,,0,3,Dépendance,,0,S,sols,,,217,3.027778,50.766986
2023-750998,2023-06-14,000001,Vente,180000,,,RUE DE WERVICQ,0930,59560,59152,Comines,59,,,59152000AA0082,,,,,,,,,,,,,0,,,,,S,sols,,,902,3.027454,50.767007
2023-750998,2023-06-14,000001,Vente,180000,,,RUE DE WERVICQ,0930,59560,59152,Comines,59,,,59152000AA0088,,,,,,,,,,,,,0,,,,,S,sols,,,2778,3.027344,50.767148
2023-751001,2023-06-14,000001,Vente,174590,28,,AV DU MARECHAL LECLERC,0370,59560,59152,Comines,59,,,59152000AH0575,,1,,,,,,,,,,,0,,,,,,,,,,3.006847,50.762578
2023-751017,2023-06-08,000001,Vente,166000,57,,RUE PHILIPPE DE COMINES,0647,59560,59152,Comines,59,,,59152000AM0395,,,,,,,,,,,,,0,1,Maison,82,5,S,sols,,,311,3.005965,50.758152
2023-751112,2023-06-14,000001,Vente,355000,125,,RUE MAURICE RAVEL,0970,59560,59152,Comines,59,,,59152000AC0299,,,,,,,,,,,,,0,1,Maison,125,5,S,sols,,,367,3.023628,50.764571
2023-751607,2023-06-21,000001,Vente,159000,,,RUE BLANCHE BANNIERE,0130,59560,59152,Comines,59,,,59152000AE0310,,,,,,,,,,,,,0,,,,,S,sols,,,14,3.016795,50.763375
2023-751607,2023-06-21,000001,Vente,159000,,,RUE BLANCHE BANNIERE,0130,59560,59152,Comines,59,,,59152000AE0314,,,,,,,,,,,,,0,,,,,S,sols,,,210,3.016639,50.763304
2023-751607,2023-06-21,000001,Vente,159000,33,B,RUE BLANCHE BANNIERE,0130,59560,59152,Comines,59,,,59152000AE0318,,,,,,,,,,,,,0,1,Maison,77,3,S,sols,,,76,3.01647,50.76338
2023-751860,2023-06-26,000001,Vente,278000,124,,RUE D ARMENTIERES,0090,59560,59152,Comines,59,,,59152000AS0053,,,,,,,,,,,,,0,,,,,PA,pâtures,,,172,2.989077,50.755681
2023-751860,2023-06-26,000001,Vente,278000,124,,RUE D ARMENTIERES,0090,59560,59152,Comines,59,,,59152000AS0054,,,,,,,,,,,,,0,3,Dépendance,,0,S,sols,,,265,2.989451,50.755522
2023-751860,2023-06-26,000001,Vente,278000,124,,RUE D ARMENTIERES,0090,59560,59152,Comines,59,,,59152000AS0054,,,,,,,,,,,,,0,1,Maison,90,4,S,sols,,,265,2.989451,50.755522
2023-751882,2023-06-14,000001,Vente,202000,173,,RUE DES PROCESSIONS,0690,59560,59152,Comines,59,,,59152000AM0410,,,,,,,,,,,,,0,1,Maison,78,5,S,sols,,,265,3.004386,50.757329
2023-752400,2023-06-30,000001,Vente en l'état futur d'achèvement,220000,7,,RUE DU VIEIL DIEU,0910,59560,59152,Comines,59,,,59152000AI0519,,,25,,,,,,,,,,1,,,,,,,,,,3.012459,50.761536
2023-752400,2023-06-30,000001,Vente en l'état futur d'achèvement,220000,7,,RUE DU VIEIL DIEU,0910,59560,59152,Comines,59,,,59152000AI0519,,,56,,,,,,,,,,1,,,,,,,,,,3.012459,50.761536
2023-752400,2023-06-30,000001,Vente en l'état futur d'achèvement,220000,7,,RUE DU VIEIL DIEU,0910,59560,59152,Comines,59,,,59152000AI0519,,,117,,,,,,,,,,1,,,,,,,,,,3.012459,50.761536