id_mutation,date_mutation,numero_disposition,nature_mutation,valeur_fonciere,adresse_numero,adresse_suffixe,adresse_nom_voie,adresse_code_voie,code_postal,code_commune,nom_commune,code_departement,ancien_code_commune,ancien_nom_commune,id_parcelle,ancien_id_parcelle,numero_volume,lot1_numero,lot1_surface_carrez,lot2_numero,lot2_surface_carrez,lot3_numero,lot3_surface_carrez,lot4_numero,lot4_surface_carrez,lot5_numero,lot5_surface_carrez,nombre_lots,code_type_local,type_local,surface_reelle_bati,nombre_pieces_principales,code_nature_culture,nature_culture,code_nature_culture_speciale,nature_culture_speciale,surface_terrain,longitude,latitude
2023-743699,2023-02-17,000001,Vente,252200,13,,RUE ROGER SALENGRO,0240,59553,59334,Lauwin-Planque,59,,,593340000A0391,,,,,,,,,,,,,0,3,Dépendance,,0,S,sols,,,509,3.050454,50.391856
2023-743699,2023-02-17,000001,Vente,252200,13,,RUE ROGER SALENGRO,0240,59553,59334,Lauwin-Planque,59,,,593340000A0391,,,,,,,,,,,,,0,3,Dépendance,,0,S,sols,,,509,3.050454,50.391856
2023-743699,2023-02-17,000001,Vente,252200,13,,RUE ROGER SALENGRO,0240,59553,59334,Lauwin-Planque,59,,,593340000A0391,,,,,,,,,,,,,0,1,Maison,77,3,S,sols,,,509,3.050454,50.391856
2023-747912,2023-04-14,000001,Vente,247000,29,,RUE THEODORE MARICHEZ,0280,59553,59334,Lauwin-Planque,59,,,593340000A1228,,,,,,,,,,,,,0,1,Maison,94,5,S,sols,,,258,3.04766,50.393169
2023-747912,2023-04-14,000001,Vente,247000,,,RUE THEODORE MARICHEZ,0280,59553,59334,Lauwin-Planque,59,,,593340000A2452,,,,,,,,,,,,,0,,,,,J,jardins,,,60,3.047796,50.393067
2023-747912,2023-04-14,000001,Vente,247000,,,RUE THEODORE MARICHEZ,0280,59553,59334,Lauwin-Planque,59,,,593340000A2454,,,,,,,,,,,,,0,,,,,J,jardins,,,126,3.047833,50.392996
2023-750442,2023-05-30,000001,Vente,140000,3,,RUE DU MARAIS,0160,59553,59334,Lauwin-Planque,59,,,593340000A0637,,,,,,,,,,,,,0,1,Maison,99,4,S,sols,,,392,3.041197,50.388326
2023-750442,2023-05-30,000001,Vente,140000,3,,RUE DU MARAIS,0160,59553,59334,Lauwin-Planque,59,,,593340000A0637,,,,,,,,,,,,,0,3,Dépendance,,0,S,sols,,,392,3.041197,50.388326
2023-750627,2023-06-16,000001,Vente,16500,9008,,RUE ROGER SALENGRO,0240,59553,59334,Lauwin-Planque,59,,,593340000A1390,,,,,,,,,,,,,0,3,Dépendance,,0,S,sols,,,26,3.047415,50.391278
2023-752047,2023-06-09,000001,Vente,119650,21,,RUE MARIE CURIE,0180,59553,59334,Lauwin-Planque,59,,,593340000A0452,,,,,,,,,,,,,0,1,Maison,81,2,S,sols,,,105,3.04942,50.393778
2023-752047,2023-06-09,000001,Vente,119650,21,,RUE MARIE CURIE,0180,59553,59334,Lauwin-Planque,59,,,593340000A0452,,,,,,,,,,,,,0,3,Dépendance,,0,S,sols,,,105,3.04942,50.393778
2023-752833,2023-06-26,000001,Vente,83000,19,,RUE MARIE CURIE,0180,59553,59334,Lauwin-Planque,59,,,593340000A0455,,,,,,,,,,,,,0,1,Maison,90,4,S,sols,,,174,3.049281,50.393795
2023-752833,2023-06-26,000001,Vente,83000,19,,RUE MARIE CURIE,0180,59553,59334,Lauwin-Planque,59,,,593340000A0455,,,,,,,,,,,,,0,3,Dépendance,,0,S,sols,,,174,3.049281,50.393795
2023-752833,2023-06-26,000001,Vente,83000,,,PLANQUE,B011,59553,59334,Lauwin-Planque,59,,,593340000A1205,,,,,,,,,,,,,0,,,,,J,jardins,,,448,3.048893,50.393618
2023-753461,2023-07-06,000001,Vente,365000,7,,RUE DE LA PAIX,0219,59553,59334,Lauwin-Planque,59,,,593340000A1822,,,,,,,,,,,,,0,1,Maison,161,6,S,sols,,,735,3.042169,50.391028
2023-753810,2023-07-13,000001,Vente,120000,,,LE CHAMP POURRI,B002,59553,59334,Lauwin-Planque,59,,,59334000ZD0257,,,,,,,,,,,,,0,,,,,AB,terrains a bâtir,,,454,3.042114,50.391611
2023-753810,2023-07-13,000001,Vente,120000,,,LE CHAMP POURRI,B002,59553,59334,Lauwin-Planque,59,,,59334000ZD0266,,,,,,,,,,,,,0,,,,,AB,terrains a bâtir,,,221,3.042196,50.391688
2023-754777,2023-07-20,000001,Vente,417372.47,7,,RUE DE LA PAIX,0219,59553,59334,Lauwin-Planque,59,,,593340000A1822,,,,,,,,,,,,,0,1,Maison,161,6,S,sols,,,735,3.042169,50.391028
2023-755365,2023-08-18,000001,Vente,137000,27,,RUE MARIE CURIE,0180,59553,59334,Lauwin-Planque,59,,,593340000A0439,,,,,,,,,,,,,0,1,Maison,74,3,S,sols,,,148,3.049611,50.393539
2023-755365,2023-08-18,000001,Vente,137000,27,,RUE MARIE CURIE,0180,59553,59334,Lauwin-Planque,59,,,593340000A0439,,,,,,,,,,,,,0,3,Dépendance,,0,S,sols,,,148,3.049611,50.393539
2023-755365,2023-08-18,000001,Vente,137000,,,PLANQUE,B011,59553,59334,Lauwin-Planque,59,,,593340000A1403,,,,,,,,,,,,,0,,,,,J,jardins,,,1150,3.049322,50.393318
2023-756816,2023-08-24,000001,Vente,119900,2,,RUE MARIE CURIE,0180,59553,59334,Lauwin-Planque,59,,,593340000A0990,,,,,,,,,,,,,0,1,Maison,74,5,S,sols,,,341,3.050147,50.393732
2023-756816,2023-08-24,000001,Vente,119900,2,,RUE MARIE CURIE,0180,59553,59334,Lauwin-Planque,59,,,593340000A0990,,,,,,,,,,,,,0,3,Dépendance,,0,S,sols,,,341,3.050147,50.393732
2023-758121,2023-09-28,000001,Vente,15000,9007,,RUE ROGER SALENGRO,0240,59553,59334,Lauwin-Planque,59,,,593340000A1389,,,,,,,,,,,,,0,3,Dépendance,,0,S,sols,,,26,3.047395,50.391308
2023-759485,2023-10-17,000001,Vente,130000,85,,RUE MARIE CURIE,0180,59553,59334,Lauwin-Planque,59,,,593340000A2113,,,,,,,,,,,,,0,3,Dépendance,,0,S,sols,,,472,3.052659,50.391213
2023-759485,2023-10-17,000001,Vente,130000,85,,RUE MARIE CURIE,0180,59553,59334,Lauwin-Planque,59,,,593340000A2113,,,,,,,,,,,,,0,3,Dépendance,,0,S,sols,,,472,3.052659,50.391213
2023-759485,2023-10-17,000001,Vente,130000,85,,RUE MARIE CURIE,0180,59553,59334,Lauwin-Planque,59,,,593340000A2113,,,,,,,,,,,,,0,3,Dépendance,,0,S,sols,,,472,3.052659,50.391213
2023-759485,2023-10-17,000001,Vente,130000,85,,RUE MARIE CURIE,0180,59553,59334,Lauwin-Planque,59,,,593340000A2113,,,,,,,,,,,,,0,3,Dépendance,,0,S,sols,,,472,3.052659,50.391213
2023-759485,2023-10-17,000001,Vente,130000,85,,RUE MARIE CURIE,0180,59553,59334,Lauwin-Planque,59,,,593340000A2113,,,,,,,,,,,,,0,3,Dépendance,,0,S,sols,,,472,3.052659,50.391213
2023-759485,2023-10-17,000001,Vente,130000,85,,RUE MARIE CURIE,0180,59553,59334,Lauwin-Planque,59,,,593340000A2113,,,,,,,,,,,,,0,3,Dépendance,,0,S,sols,,,472,3.052659,50.391213
2023-759485,2023-10-17,000001,Vente,130000,85,,RUE MARIE CURIE,0180,59553,59334,Lauwin-Planque,59,,,593340000A2113,,,,,,,,,,,,,0,3,Dépendance,,0,S,sols,,,472,3.052659,50.391213
2023-759485,2023-10-17,000001,Vente,130000,85,,RUE MARIE CURIE,0180,59553,59334,Lauwin-Planque,59,,,593340000A2113,,,,,,,,,,,,,0,3,Dépendance,,0,S,sols,,,472,3.052659,50.391213
2023-759485,2023-10-17,000001,Vente,130000,85,,RUE MARIE CURIE,0180,59553,59334,Lauwin-Planque,59,,,593340000A2113,,,,,,,,,,,,,0,3,Dépendance,,0,S,sols,,,472,3.052659,50.391213
2023-759485,2023-10-17,000001,Vente,130000,85,,RUE MARIE CURIE,0180,59553,59334,Lauwin-Planque,59,,,593340000A2113,,,,,,,,,,,,,0,3,Dépendance,,0,S,sols,,,472,3.052659,50.391213
2023-759485,2023-10-17,000001,Vente,130000,85,,RUE MARIE CURIE,0180,59553,59334,Lauwin-Planque,59,,,593340000A2113,,,,,,,,,,,,,0,3,Dépendance,,0,S,sols,,,472,3.052659,50.391213
2023-759485,2023-10-17,000001,Vente,130000,85,,RUE MARIE CURIE,0180,59553,59334,Lauwin-Planque,59,,,593340000A2113,,,,,,,,,,,,,0,3,Dépendance,,0,S,sols,,,472,3.052659,50.391213
2023-759485,2023-10-17,000001,Vente,130000,85,,RUE MARIE CURIE,0180,59553,59334,Lauwin-Planque,59,,,593340000A2113,,,,,,,,,,,,,0,3,Dépendance,,0,S,sols,,,472,3.052659,50.391213
2023-759485,2023-10-17,000001,Vente,130000,85,,RUE MARIE CURIE,0180,59553,59334,Lauwin-Planque,59,,,593340000A2113,,,,,,,,,,,,,0,3,Dépendance,,0,S,sols,,,472,3.052659,50.391213
2023-759485,2023-10-17,000001,Vente,130000,85,,RUE MARIE CURIE,0180,59553,59334,Lauwin-Planque,59,,,593340000A2113,,,,,,,,,,,,,0,3,Dépendance,,0,S,sols,,,472,3.052659,50.391213
2023-759485,2023-10-17,000001,Vente,130000,85,,RUE MARIE CURIE,0180,59553,59334,Lauwin-Planque,59,,,593340000A2113,,,,,,,,,,,,,0,3,Dépendance,,0,S,sols,,,472,3.052659,50.391213
2023-759485,2023-10-17,000001,Vente,130000,85,,RUE MARIE CURIE,0180,59553,59334,Lauwin-Planque,59,,,593340000A2113,,,,,,,,,,,,,0,3,Dépendance,,0,S,sols,,,472,3.052659,50.391213
2023-759485,2023-10-17,000001,Vente,130000,85,,RUE MARIE CURIE,0180,59553,59334,Lauwin-Planque,59,,,593340000A2113,,,,,,,,,,,,,0,3,Dépendance,,0,S,sols,,,472,3.052659,50.391213
2023-759485,2023-10-17,000001,Vente,130000,85,,RUE MARIE CURIE,0180,59553,59334,Lauwin-Planque,59,,,593340000A2113,,,,,,,,,,,,,0,3,Dépendance,,0,S,sols,,,472,3.052659,50.391213
2023-759485,2023-10-17,000001,Vente,130000,85,,RUE MARIE CURIE,0180,59553,59334,Lauwin-Planque,59,,,593340000A2113,,,,,,,,,,,,,0,3,Dépendance,,0,S,sols,,,472,3.052659,50.391213
2023-759485,2023-10-17,000001,Vente,130000,85,,RUE MARIE CURIE,0180,59553,59334,Lauwin-Planque,59,,,593340000A2113,,,,,,,,,,,,,0,3,Dépendance,,0,S,sols,,,472,3.052659,50.391213
2023-759485,2023-10-17,000001,Vente,130000,85,,RUE MARIE CURIE,0180,59553,59334,Lauwin-Planque,59,,,593340000A2113,,,,,,,,,,,,,0,3,Dépendance,,0,S,sols,,,472,3.052659,50.391213
2023-759485,2023-10-17,000001,Vente,130000,85,,RUE MARIE CURIE,0180,59553,59334,Lauwin-Planque,59,,,593340000A2113,,,,,,,,,,,,,0,3,Dépendance,,0,S,sols,,,472,3.052659,50.391213
2023-759485,2023-10-17,000001,Vente,130000,85,,RUE MARIE CURIE,0180,59553,59334,Lauwin-Planque,59,,,593340000A2113,,,,,,,,,,,,,0,3,Dépendance,,0,S,sols,,,472,3.052659,50.391213
2023-759485,2023-10-17,000001,Vente,130000,85,,RUE MARIE CURIE,0180,59553,59334,Lauwin-Planque,59,,,593340000A2113,,,,,,,,,,,,,0,3,Dépendance,,0,S,sols,,,472,3.052659,50.391213
2023-759485,2023-10-17,000001,Vente,130000,85,,RUE MARIE CURIE,0180,59553,59334,Lauwin-Planque,59,,,593340000A2113,,,,,,,,,,,,,0,3,Dépendance,,0,S,sols,,,472,3.052659,50.391213
2023-760074,2023-10-26,000001,Vente,2.4,,,LES VINGT DEUX,B017,59553,59334,Lauwin-Planque,59,,,59334000ZD0186,,,,,,,,,,,,,0,,,,,S,sols,,,39497,3.03523,50.395563
2023-760074,2023-10-26,000001,Vente,2.4,,,LES HUSSARDS,B006,59553,59334,Lauwin-Planque,59,,,59334000ZD0189,,,,,,,,,,,,,0,,,,,S,sols,,,2738,3.035852,50.396013
2023-760074,2023-10-26,000001,Vente,2.4,,,LES HUSSARDS,B006,59553,59334,Lauwin-Planque,59,,,59334000ZD0192,,,,,,,,,,,,,0,,,,,S,sols,,,8014,3.036386,50.39589
2023-760074,2023-10-26,000001,Vente,2.4,195,,ZAC DE LAUWIN PLANQUE,0296,59553,59334,Lauwin-Planque,59,,,59334000ZD0195,,,,,,,,,,,,,0,4,Local industriel. commercial ou assimilé,,,S,sols,,,2657,3.03677,50.395893
2023-760074,2023-10-26,000001,Vente,2.4,,,LES HUSSARDS,B006,59553,59334,Lauwin-Planque,59,,,59334000ZD0198,,,,,,,,,,,,,0,,,,,S,sols,,,3394,3.036715,50.396075
2023-760074,2023-10-26,000001,Vente,2.4,,,LES HUSSARDS,B006,59553,59334,Lauwin-Planque,59,,,59334000ZD0201,,,,,,,,,,,,,0,,,,,S,sols,,,6700,3.036912,50.39618
2023-760074,2023-10-26,000001,Vente,2.4,,,LES HUSSARDS,B006,59553,59334,Lauwin-Planque,59,,,59334000ZD0209,,,,,,,,,,,,,0,,,,,AB,terrains a bâtir,,,1485,3.037333,50.396385
2023-760074,2023-10-26,000001,Vente,2.4,,,LES HUSSARDS,B006,59553,59334,Lauwin-Planque,59,,,59334000ZD0212,,,,,,,,,,,,,0,,,,,AB,terrains a bâtir,,,7415,3.037498,50.396481
2023-760074,2023-10-26,000001,Vente,2.4,,,LES HUSSARDS,B006,59553,59334,Lauwin-Planque,59,,,59334000ZD0215,,,,,,,,,,,,,0,,,,,AB,terrains a bâtir,,,12026,3.037945,50.396797
2023-760074,2023-10-26,000001,Vente,2.4,,,LES HUSSARDS,B006,59553,59334,Lauwin-Planque,59,,,59334000ZD0219,,,,,,,,,,,,,0,,,,,AB,terrains a bâtir,,,331,3.038962,50.396851
2023-760074,2023-10-26,000001,Vente,2.4,,,LES HUSSARDS,B006,59553,59334,Lauwin-Planque,59,,,59334000ZD0223,,,,,,,,,,,,,0,,,,,AB,terrains a bâtir,,,246,3.039106,50.396851
2023-760074,2023-10-26,000001,Vente,2.4,,,LES HUSSARDS,B006,59553,59334,Lauwin-Planque,59,,,59334000ZD0229,,,,,,,,,,,,,0,,,,,AB,terrains a bâtir,,,220,3.039281,50.396832
2023-760074,2023-10-26,000001,Vente,2.4,,,LES HUSSARDS,B006,59553,59334,Lauwin-Planque,59,,,59334000ZD0235,,,,,,,,,,,,,0,,,,,AB,terrains a bâtir,,,3277,3.037192,50.396311
2023-760591,2023-10-19,000001,Vente,147000,4,,RUE VOLTAIRE,0295,59553,59334,Lauwin-Planque,59,,,593340000A2395,,,,,,,,,,,,,0,1,Maison,111,6,S,sols,,,228,3.050908,50.395139
2023-761215,2023-11-16,000001,Vente,12500,9016,,RUE ROGER SALENGRO,0240,59553,59334,Lauwin-Planque,59,,,593340000A1398,,,,,,,,,,,,,0,3,Dépendance,,0,S,sols,,,26,3.047579,50.39104
2023-761673,2023-11-27,000001,Vente,1,,,LE VILLAGE,B015,59553,59334,Lauwin-Planque,59,,,593340000A2498,,,,,,,,,,,,,0,,,,,S,sols,,,8,3.040639,50.390425
2023-761679,2023-11-27,000001,Vente,14000,9009,,RUE ROGER SALENGRO,0240,59553,59334,Lauwin-Planque,59,,,593340000A1391,,,,,,,,,,,,,0,3,Dépendance,,0,S,sols,,,26,3.047434,50.391249
2023-762175,2023-11-10,000001,Vente,69000,51,,RUE MARIE CURIE,0180,59553,59334,Lauwin-Planque,59,,,593340000A1030,,,,,,,,,,,,,0,1,Maison,70,4,S,sols,,,128,3.050477,50.392948
2023-762175,2023-11-10,000001,Vente,69000,,,RUE MARIE CURIE,0180,59553,59334,Lauwin-Planque,59,,,593340000A1862,,,,,,,,,,,,,0,,,,,S,sols,,,32,3.050353,50.392903
2023-762240,2023-11-21,000001,Vente,130000,2,,RUE CHRISTOPHE COLOMB,0050,59553,59334,Lauwin-Planque,59,,,593340000A2495,,,,,,,,,,,,,0,1,Maison,78,3,S,sols,,,335,3.040232,50.390589
2023-762740,2023-11-30,000001,Vente,140000,42,,RUE ROGER SALENGRO,0240,59553,59334,Lauwin-Planque,59,,,593340000A1960,,,,,,,,,,,,,0,1,Maison,170,7,S,sols,,,550,3.048738,50.390806
2023-762948,2023-12-08,000001,Vente,119924,,,LE CHAMP POURRI,B002,59553,59334,Lauwin-Planque,59,,,59334000ZD0042,,,,,,,,,,,,,0,,,,,T,terres,,,5559,3.042316,50.392448
2023-764404,2023-12-18,000002,Vente,188372,,,LE CHAMP POURRI,B002,59553,59334,Lauwin-Planque,59,,,59334000ZD0040,,,,,,,,,,,,,0,,,,,T,terres,,,1304,3.041799,50.392134
2023-764404,2023-12-18,000002,Vente,188372,,,LE CHAMP POURRI,B002,59553,59334,Lauwin-Planque,59,,,59334000ZD0040,,,,,,,,,,,,,0,,,,,T,terres,,,1100,3.041799,50.392134
2023-764404,2023-12-18,000002,Vente,188372,,,LE CHAMP POURRI,B002,59553,59334,Lauwin-Planque,59,,,59334000ZD0041,,,,,,,,,,,,,0,,,,,T,terres,,,4500,3.042078,50.392284
2023-764404,2023-12-18,000002,Vente,188372,,,LE CHAMP POURRI,B002,59553,59334,Lauwin-Planque,59,,,59334000ZD0041,,,,,,,,,,,,,0,,,,,T,terres,,,5138,3.042078,50.392284
2023-764434,2023-12-27,000001,Vente,85000,47,B,RUE THEODORE MARICHEZ,0280,59553,59334,Lauwin-Planque,59,,,593340000A2046,,,4,51.96,,,,,,,,,1,2,Appartement,52,2,,,,,,3.0486,50.394239
2023-764434,2023-12-27,000001,Vente,85000,47,,RUE THEODORE MARICHEZ,0280,59553,59334,Lauwin-Planque,59,,,593340000A2046,,,12,,,,,,,,,,1,3,Dépendance,,0,,,,,,3.0486,50.394239
2023-764666,2023-12-29,000001,Vente,71000,47,B,RUE THEODORE MARICHEZ,0280,59553,59334,Lauwin-Planque,59,,,593340000A2046,,,3,45.59,,,,,,,,,1,2,Appartement,45,2,,,,,,3.0486,50.394239
2023-764666,2023-12-29,000001,Vente,71000,47,,RUE THEODORE MARICHEZ,0280,59553,59334,Lauwin-Planque,59,,,593340000A2046,,,11,,,,,,,,,,1,3,Dépendance,,0,,,,,,3.0486,50.394239
