id_mutation,date_mutation,numero_disposition,nature_mutation,valeur_fonciere,adresse_numero,adresse_suffixe,adresse_nom_voie,adresse_code_voie,code_postal,code_commune,nom_commune,code_departement,ancien_code_commune,ancien_nom_commune,id_parcelle,ancien_id_parcelle,numero_volume,lot1_numero,lot1_surface_carrez,lot2_numero,lot2_surface_carrez,lot3_numero,lot3_surface_carrez,lot4_numero,lot4_surface_carrez,lot5_numero,lot5_surface_carrez,nombre_lots,code_type_local,type_local,surface_reelle_bati,nombre_pieces_principales,code_nature_culture,nature_culture,code_nature_culture_speciale,nature_culture_speciale,surface_terrain,longitude,latitude
2023-770377,2023-01-06,000001,Vente,150300,10,,RUE DE LA CHAPELLE,0030,59400,59405,Mœuvres,59,,,59405000ZM0076,,,,,,,,,,,,,0,1,Maison,73,4,S,sols,,,682,3.064378,50.158391
2023-771478,2023-02-08,000001,Vente,18187.4,,,LES DIX HUIT,B017,59400,59405,Mœuvres,59,,,59405000ZM0003,,,,,,,,,,,,,0,,,,,T,terres,,,15857,3.064027,50.155659
2023-771481,2023-02-17,000001,Vente,288500,19,,RUE D EN HAUT,0120,59400,59405,Mœuvres,59,,,594050000A1177,,,,,,,,,,,,,0,1,Maison,150,6,S,sols,,,576,3.068936,50.164608
2023-771481,2023-02-17,000001,Vente,288500,19,,RUE D EN HAUT,0120,59400,59405,Mœuvres,59,,,594050000A1177,,,,,,,,,,,,,0,3,Dépendance,,0,S,sols,,,576,3.068936,50.164608
2023-771481,2023-02-17,000001,Vente,288500,19,,RUE D EN HAUT,0120,59400,59405,Mœuvres,59,,,594050000A1177,,,,,,,,,,,,,0,3,Dépendance,,0,S,sols,,,576,3.068936,50.164608
2023-771481,2023-02-17,000001,Vente,288500,,,AU CHEMIN DE CAMBRAI,B005,59400,59405,Mœuvres,59,,,59405000ZI0035,,,,,,,,,,,,,0,,,,,T,terres,,,3180,3.068842,50.1655
2023-771481,2023-02-17,000001,Vente,288500,,,AU CHEMIN DE CAMBRAI,B005,59400,59405,Mœuvres,59,,,59405000ZI0066,,,,,,,,,,,,,0,,,,,T,terres,,,2400,3.068836,50.164899
2023-771491,2023-02-15,000001,Vente,,,,A LA VOIE DE BOURSIES,B029,59400,59405,Mœuvres,59,,,59405000ZN0068,,,,,,,,,,,,,0,,,,,T,terres,,,780,3.056463,50.155524
2023-771491,2023-02-15,000001,Vente,,,,A LA VOIE DE BOURSIES,B029,59400,59405,Mœuvres,59,,,59405000ZN0069,,,,,,,,,,,,,0,,,,,T,terres,,,830,3.057518,50.155271
2023-771491,2023-02-15,000001,Vente,,,,A LA VOIE DE BOURSIES,B029,59400,59405,Mœuvres,59,,,59405000ZN0070,,,,,,,,,,,,,0,,,,,T,terres,,,1740,3.057021,50.15529
2023-771651,2023-01-23,000002,Vente,40000,,,A LA VOIE DE PRONVILLE,B030,59400,59405,Mœuvres,59,,,59405000ZO0122,,,,,,,,,,,,,0,,,,,T,terres,,,1523,3.06108,50.163824
2023-771884,2023-03-06,000001,Vente,19040,,,LA LONGUE ROIE,B021,59400,59405,Mœuvres,59,,,59405000ZN0050,,,,,,,,,,,,,0,,,,,T,terres,,,9520,3.066658,50.148827
2023-771898,2023-03-02,000001,Vente,2500,,,LA LONGUE ROIE,B021,59400,59405,Mœuvres,59,,,59405000ZN0051,,,,,,,,,,,,,0,,,,,T,terres,,,3542,3.066371,50.149533
2023-774160,2023-05-25,000001,Vente,226100,,,LE VILLAGE,B028,59400,59405,Mœuvres,59,,,594050000A0715,,,,,,,,,,,,,0,,,,,J,jardins,POTAG,Jardin potager,520,3.065419,50.164882
2023-774160,2023-05-25,000001,Vente,226100,,,RUE DU MARAIS,0136,59400,59405,Mœuvres,59,,,594050000A1158,,,,,,,,,,,,,0,,,,,S,sols,,,190,3.065743,50.164849
2023-774160,2023-05-25,000001,Vente,226100,,,LE VILLAGE,B028,59400,59405,Mœuvres,59,,,594050000A1159,,,,,,,,,,,,,0,,,,,J,jardins,POTAG,Jardin potager,89,3.065719,50.164952
2023-774217,2023-05-02,000001,Vente,15000,,,LE VILLAGE,B028,59400,59405,Mœuvres,59,,,594050000A0804,,,,,,,,,,,,,0,,,,,J,jardins,POTAG,Jardin potager,640,3.066378,50.162815
2023-776336,2023-07-25,000001,Vente,16000,,,LE VILLAGE,B028,59400,59405,Mœuvres,59,,,594050000A0645,,,,,,,,,,,,,0,,,,,PA,pâtures,,,3436,3.062344,50.165505
2023-777082,2023-07-31,000001,Vente,75000,20,,RUE DE L EGLISE,0080,59400,59405,Mœuvres,59,,,594050000A1109,,,,,,,,,,,,,0,1,Maison,72,3,S,sols,,,720,3.067459,50.163773
2023-777082,2023-07-31,000001,Vente,75000,20,,RUE DE L EGLISE,0080,59400,59405,Mœuvres,59,,,594050000A1109,,,,,,,,,,,,,0,3,Dépendance,,0,S,sols,,,720,3.067459,50.163773
2023-777192,2023-08-24,000001,Vente,250000,,,LE VILLAGE,B028,59400,59405,Mœuvres,59,,,594050000A0651,,,,,,,,,,,,,0,,,,,T,terres,,,665,3.063868,50.165729
2023-777192,2023-08-24,000001,Vente,250000,,,LE VILLAGE,B028,59400,59405,Mœuvres,59,,,594050000A0652,,,,,,,,,,,,,0,,,,,J,jardins,POTAG,Jardin potager,200,3.063926,50.165554
2023-777192,2023-08-24,000001,Vente,250000,,,LE VILLAGE,B028,59400,59405,Mœuvres,59,,,594050000A0653,,,,,,,,,,,,,0,,,,,J,jardins,MARAI,Pré marais,398,3.06366,50.165618
2023-777192,2023-08-24,000001,Vente,250000,,,RUE D INCHY,0125,59400,59405,Mœuvres,59,,,594050000A0679,,,,,,,,,,,,,0,,,,,S,sols,,,560,3.063743,50.164777
2023-777192,2023-08-24,000001,Vente,250000,3,,RUE D INCHY,0125,59400,59405,Mœuvres,59,,,594050000A0680,,,,,,,,,,,,,0,3,Dépendance,,0,S,sols,,,1392,3.064158,50.164649
2023-777192,2023-08-24,000001,Vente,250000,3,,RUE D INCHY,0125,59400,59405,Mœuvres,59,,,594050000A0680,,,,,,,,,,,,,0,1,Maison,164,6,S,sols,,,1392,3.064158,50.164649
2023-777192,2023-08-24,000001,Vente,250000,,,RUE DU CALVAIRE,0020,59400,59405,Mœuvres,59,,,594050000A1041,,,,,,,,,,,,,0,,,,,J,jardins,POTAG,Jardin potager,83,3.063376,50.165641
2023-777192,2023-08-24,000001,Vente,250000,,,LE VILLAGE,B028,59400,59405,Mœuvres,59,,,594050000A1074,,,,,,,,,,,,,0,,,,,J,jardins,POTAG,Jardin potager,265,3.063517,50.164791
2023-777192,2023-08-24,000001,Vente,250000,,,RUE DU CALVAIRE,0020,59400,59405,Mœuvres,59,,,594050000A1124,,,,,,,,,,,,,0,,,,,S,sols,,,2653,3.063574,50.165254
2023-781354,2023-12-22,000001,Vente,191715,1,,RUE EMILE FLAMANT,0090,59400,59405,Mœuvres,59,,,59405000ZM0121,,,,,,,,,,,,,0,1,Maison,101,4,S,sols,,,868,3.064335,50.159886
