id_mutation,date_mutation,numero_disposition,nature_mutation,valeur_fonciere,adresse_numero,adresse_suffixe,adresse_nom_voie,adresse_code_voie,code_postal,code_commune,nom_commune,code_departement,ancien_code_commune,ancien_nom_commune,id_parcelle,ancien_id_parcelle,numero_volume,lot1_numero,lot1_surface_carrez,lot2_numero,lot2_surface_carrez,lot3_numero,lot3_surface_carrez,lot4_numero,lot4_surface_carrez,lot5_numero,lot5_surface_carrez,nombre_lots,code_type_local,type_local,surface_reelle_bati,nombre_pieces_principales,code_nature_culture,nature_culture,code_nature_culture_speciale,nature_culture_speciale,surface_terrain,longitude,latitude
2023-771642,2023-02-06,000001,Vente,77000,50,,RUE DU CAP D ARCHE,0050,59360,59450,Ors,59,,,594500000B0007,,,,,,,,,,,,,0,1,Maison,60,2,S,sols,,,262,3.629458,50.098346
2023-772107,2023-03-14,000001,Vente,8250,,,LA CAVEE,B004,59360,59450,Ors,59,,,594500000C0008,,,,,,,,,,,,,0,,,,,T,terres,,,5859,3.621551,50.092269
2023-772107,2023-03-14,000001,Vente,8250,,,PRES SOURIS,B038,59360,59450,Ors,59,,,594500000C0210,,,,,,,,,,,,,0,,,,,PA,pâtures,,,9190,3.623425,50.092227
2023-772108,2023-03-14,000001,Vente,112700,19,,RUE DE LA GRANDE PRAIRIE,0100,59360,59450,Ors,59,,,594500000B0749,,,,,,,,,,,,,0,1,Maison,93,3,S,sols,,,530,3.64125,50.100088
2023-772108,2023-03-14,000001,Vente,112700,19,,RUE DE LA GRANDE PRAIRIE,0100,59360,59450,Ors,59,,,594500000B0749,,,,,,,,,,,,,0,3,Dépendance,,0,S,sols,,,530,3.64125,50.100088
2023-772108,2023-03-14,000001,Vente,112700,18,,RUE DE LA GRANDE PRAIRIE,0100,59360,59450,Ors,59,,,594500000B1069,,,,,,,,,,,,,0,,,,,PA,pâtures,,,51,3.641278,50.099988
2023-772108,2023-03-14,000001,Vente,112700,18,,RUE DE LA GRANDE PRAIRIE,0100,59360,59450,Ors,59,,,594500000B1070,,,,,,,,,,,,,0,,,,,PA,pâtures,,,284,3.641373,50.100138
2023-774655,2023-05-22,000001,Vente,264000,13,,RUE DE LANDRECIES,0140,59360,59450,Ors,59,,,594500000B1051,,,,,,,,,,,,,0,1,Maison,103,4,AG,terrains d'agrément,,,1653,3.64777,50.100406
2023-774655,2023-05-22,000001,Vente,264000,13,,RUE DE LANDRECIES,0140,59360,59450,Ors,59,,,594500000B1051,,,,,,,,,,,,,0,1,Maison,103,4,S,sols,,,444,3.64777,50.100406
2023-776104,2023-07-12,000002,Vente,1,,,L ECLUSE,B013,59360,59450,Ors,59,,,594500000A0499,,,,,,,,,,,,,0,,,,,T,terres,,,512,3.632488,50.10495
2023-776571,2023-07-31,000001,Vente,12000,,,LES RONIERES,B040,59360,59450,Ors,59,,,594500000C0101,,,,,,,,,,,,,0,,,,,PA,pâtures,,,6682,3.62752,50.095819
2023-778023,2023-09-01,000002,Echange,,,,RUE D OUIES,0180,59360,59450,Ors,59,,,594500000B1171,,,,,,,,,,,,,0,,,,,PA,pâtures,,,954,3.637725,50.107606
2023-778023,2023-09-01,000002,Echange,,,,RUE D OUIES,0180,59360,59450,Ors,59,,,594500000B1173,,,,,,,,,,,,,0,,,,,J,jardins,,,86,3.637637,50.107516
2023-778023,2023-09-01,000003,Echange,,,,RUE D OUIES,0180,59360,59450,Ors,59,,,594500000B0442,,,,,,,,,,,,,0,,,,,S,sols,,,231,3.637303,50.107361
2023-778023,2023-09-01,000003,Echange,,,,RUE D OUIES,0180,59360,59450,Ors,59,,,594500000B0442,,,,,,,,,,,,,0,,,,,J,jardins,,,809,3.637303,50.107361
2023-778879,2023-10-13,000001,Vente,100000,12,,RUE DE LA LOUVIERE,0160,59360,59450,Ors,59,,,594500000A0407,,,,,,,,,,,,,0,3,Dépendance,,0,S,sols,,,537,3.632783,50.104596
2023-778879,2023-10-13,000001,Vente,100000,12,,RUE DE LA LOUVIERE,0160,59360,59450,Ors,59,,,594500000A0407,,,,,,,,,,,,,0,1,Maison,78,5,S,sols,,,537,3.632783,50.104596
2023-779174,2023-10-12,000001,Vente,170000,2,,RUE DES TILLEULS,0280,59360,59450,Ors,59,,,594500000A0418,,,,,,,,,,,,,0,1,Maison,94,4,J,jardins,,,2356,3.62549,50.104975
2023-779174,2023-10-12,000001,Vente,170000,2,,RUE DES TILLEULS,0280,59360,59450,Ors,59,,,594500000A0418,,,,,,,,,,,,,0,1,Maison,94,4,S,sols,,,228,3.62549,50.104975
2023-779174,2023-10-12,000001,Vente,170000,2,,RUE DES TILLEULS,0280,59360,59450,Ors,59,,,594500000A0418,,,,,,,,,,,,,0,3,Dépendance,,0,S,sols,,,228,3.62549,50.104975
2023-779174,2023-10-12,000001,Vente,170000,2,,RUE DES TILLEULS,0280,59360,59450,Ors,59,,,594500000A0418,,,,,,,,,,,,,0,3,Dépendance,,0,J,jardins,,,2356,3.62549,50.104975
2023-780315,2023-11-28,000001,Vente,160000,5001,F,RUE D OUIES,0180,59360,59450,Ors,59,,,594500000B0095,,,,,,,,,,,,,0,4,Local industriel. commercial ou assimilé,5,0,S,sols,,,5,3.634998,50.104333
2023-780315,2023-11-28,000001,Vente,160000,22,,RUE D OUIES,0180,59360,59450,Ors,59,,,594500000B0096,,,,,,,,,,,,,0,1,Maison,193,7,S,sols,,,1114,3.635117,50.104143
2023-780315,2023-11-28,000001,Vente,160000,22,,RUE D OUIES,0180,59360,59450,Ors,59,,,594500000B0096,,,,,,,,,,,,,0,3,Dépendance,,0,S,sols,,,1114,3.635117,50.104143
2023-780315,2023-11-28,000001,Vente,160000,22,,RUE D OUIES,0180,59360,59450,Ors,59,,,594500000B0096,,,,,,,,,,,,,0,3,Dépendance,,0,S,sols,,,1114,3.635117,50.104143
2023-780315,2023-11-28,000001,Vente,160000,,,RUE D OUIES,0180,59360,59450,Ors,59,,,594500000B0933,,,,,,,,,,,,,0,,,,,PA,pâtures,,,558,3.635227,50.104193
2023-780315,2023-11-28,000001,Vente,160000,,,RUE D OUIES,0180,59360,59450,Ors,59,,,594500000B0933,,,,,,,,,,,,,0,,,,,S,sols,,,103,3.635227,50.104193
