id_mutation,date_mutation,numero_disposition,nature_mutation,valeur_fonciere,adresse_numero,adresse_suffixe,adresse_nom_voie,adresse_code_voie,code_postal,code_commune,nom_commune,code_departement,ancien_code_commune,ancien_nom_commune,id_parcelle,ancien_id_parcelle,numero_volume,lot1_numero,lot1_surface_carrez,lot2_numero,lot2_surface_carrez,lot3_numero,lot3_surface_carrez,lot4_numero,lot4_surface_carrez,lot5_numero,lot5_surface_carrez,nombre_lots,code_type_local,type_local,surface_reelle_bati,nombre_pieces_principales,code_nature_culture,nature_culture,code_nature_culture_speciale,nature_culture_speciale,surface_terrain,longitude,latitude
2023-788196,2023-01-30,000001,Vente,650000,6,,LE BOSQUET,B003,60440,60148,Chèvreville,60,,,60148000ZI0041,,,,,,,,,,,,,0,4,Local industriel. commercial ou assimilé,280,0,S,sols,,,2369,2.84262,49.105757
2023-788196,2023-01-30,000001,Vente,650000,6,,LE BOSQUET,B003,60440,60148,Chèvreville,60,,,60148000ZI0041,,,,,,,,,,,,,0,1,Maison,119,5,S,sols,,,2369,2.84262,49.105757
2023-788321,2023-02-17,000001,Vente,366000,2,,RUE DES MEUNIERS,0030,60440,60148,Chèvreville,60,,,60148000AC0337,,,,,,,,,,,,,0,3,Dépendance,,0,S,sols,,,563,2.852155,49.109873
2023-788321,2023-02-17,000001,Vente,366000,2,,RUE DES MEUNIERS,0030,60440,60148,Chèvreville,60,,,60148000AC0337,,,,,,,,,,,,,0,1,Maison,240,7,S,sols,,,563,2.852155,49.109873
2023-788321,2023-02-17,000001,Vente,366000,5009,F,LE FLANDRIER,B010,60440,60148,Chèvreville,60,,,60148000AC0342,,,,,,,,,,,,,0,,,,,S,sols,,,500,2.851876,49.109736
2023-788321,2023-02-17,000001,Vente,366000,5009,F,LE FLANDRIER,B010,60440,60148,Chèvreville,60,,,60148000AC0342,,,,,,,,,,,,,0,,,,,AG,terrains d'agrément,,,215,2.851876,49.109736
2023-789188,2023-04-12,000001,Vente,403950,,,LE VILLAGE,B027,60440,60148,Chèvreville,60,,,60148000AC0002,,,,,,,,,,,,,0,,,,,AG,terrains d'agrément,,,1240,2.844305,49.109918
2023-789188,2023-04-12,000001,Vente,403950,,,LE VILLAGE,B027,60440,60148,Chèvreville,60,,,60148000AC0338,,,,,,,,,,,,,0,,,,,T,terres,,,1226,2.843909,49.10984
2023-789188,2023-04-12,000001,Vente,403950,4,,RUE DU MOULIN,0034,60440,60148,Chèvreville,60,,,60148000AC0340,,,,,,,,,,,,,0,1,Maison,389,8,S,sols,,,458,2.844375,49.109657
2023-789188,2023-04-12,000001,Vente,403950,4,,RUE DU MOULIN,0034,60440,60148,Chèvreville,60,,,60148000AC0340,,,,,,,,,,,,,0,3,Dépendance,,0,S,sols,,,458,2.844375,49.109657
2023-791349,2023-07-03,000001,Vente,11680,,,LA CONTEE,B007,60440,60148,Chèvreville,60,,,60148000ZB0038,,,,,,,,,,,,,0,,,,,T,terres,,,12707,2.872731,49.127113
2023-791354,2023-07-03,000001,Vente,24310,,,LA CONTEE,B007,60440,60148,Chèvreville,60,,,60148000ZB0037,,,,,,,,,,,,,0,,,,,T,terres,,,26453,2.87111,49.127067
2023-791733,2023-07-28,000001,Vente,117500,2,,ALL DES NOYERS,0041,60440,60148,Chèvreville,60,,,60148000AC0148,,,,,,,,,,,,,0,3,Dépendance,,0,S,sols,,,536,2.850487,49.110415
2023-791733,2023-07-28,000001,Vente,117500,2,,ALL DES NOYERS,0041,60440,60148,Chèvreville,60,,,60148000AC0148,,,,,,,,,,,,,0,1,Maison,82,4,S,sols,,,536,2.850487,49.110415
2023-792105,2023-09-01,000001,Vente,150000,,,LE VILLAGE,B027,60440,60148,Chèvreville,60,,,60148000AC0182,,,,,,,,,,,,,0,,,,,S,sols,,,13,2.847605,49.109387
2023-792105,2023-09-01,000001,Vente,150000,2,,RUE DE L'EGLISE,0022,60440,60148,Chèvreville,60,,,60148000AC0183,,,,,,,,,,,,,0,1,Maison,88,4,S,sols,,,62,2.847516,49.109368
2023-792105,2023-09-01,000001,Vente,150000,,,LE VILLAGE,B027,60440,60148,Chèvreville,60,,,60148000AC0252,,,,,,,,,,,,,0,,,,,S,sols,,,20,2.847443,49.109299
2023-792105,2023-09-01,000001,Vente,150000,5290,F,RUE DE LA NOUETTE,0039,60440,60148,Chèvreville,60,,,60148000AC0290,,,,,,,,,,,,,0,3,Dépendance,,0,S,sols,,,26,2.847088,49.108966
2023-792683,2023-09-19,000001,Vente,255000,,,SENNEVIERES,B021,60440,60148,Chèvreville,60,,,60148000AB0113,,,,,,,,,,,,,0,,,,,S,sols,,,112,2.855292,49.122301
2023-792683,2023-09-19,000001,Vente,255000,24,,RUE DES ROCHES,0055,60440,60148,Chèvreville,60,,,60148000AB0153,,,,,,,,,,,,,0,1,Maison,66,3,S,sols,,,352,2.855109,49.122334
2023-792683,2023-09-19,000001,Vente,255000,,,SENNEVIERES,B021,60440,60148,Chèvreville,60,,,60148000AB0210,,,,,,,,,,,,,0,,,,,S,sols,,,75,2.855034,49.122323
