id_mutation,date_mutation,numero_disposition,nature_mutation,valeur_fonciere,adresse_numero,adresse_suffixe,adresse_nom_voie,adresse_code_voie,code_postal,code_commune,nom_commune,code_departement,ancien_code_commune,ancien_nom_commune,id_parcelle,ancien_id_parcelle,numero_volume,lot1_numero,lot1_surface_carrez,lot2_numero,lot2_surface_carrez,lot3_numero,lot3_surface_carrez,lot4_numero,lot4_surface_carrez,lot5_numero,lot5_surface_carrez,nombre_lots,code_type_local,type_local,surface_reelle_bati,nombre_pieces_principales,code_nature_culture,nature_culture,code_nature_culture_speciale,nature_culture_speciale,surface_terrain,longitude,latitude
2023-781891,2023-01-24,000001,Vente,3000,,,LE FOND DE LA HAUTE RUE OU,B057,60850,60187,Cuigy-en-Bray,60,,,601870000Z0516,,,,,,,,,,,,,0,,,,,T,terres,,,6130,1.858936,49.437922
2023-782076,2023-02-08,000001,Vente,2500,,,LES BOSQUETS,B012,60850,60187,Cuigy-en-Bray,60,,,601870000C0064,,,,,,,,,,,,,0,,,,,BS,taillis sous futaie,,,527,1.819649,49.435505
2023-782076,2023-02-08,000001,Vente,2500,,,LES BOSQUETS,B012,60850,60187,Cuigy-en-Bray,60,,,601870000C0066,,,,,,,,,,,,,0,,,,,BS,taillis sous futaie,,,2548,1.819104,49.435587
2023-782078,2023-01-20,000001,Vente,170000,26,,RUE LUCIEN GODEFROY,0012,60850,60187,Cuigy-en-Bray,60,,,601870000C0241,,,,,,,,,,,,,0,3,Dépendance,,0,S,sols,,,795,1.826264,49.428269
2023-782078,2023-01-20,000001,Vente,170000,26,,RUE LUCIEN GODEFROY,0012,60850,60187,Cuigy-en-Bray,60,,,601870000C0241,,,,,,,,,,,,,0,3,Dépendance,,0,S,sols,,,795,1.826264,49.428269
2023-782078,2023-01-20,000001,Vente,170000,26,,RUE LUCIEN GODEFROY,0012,60850,60187,Cuigy-en-Bray,60,,,601870000C0241,,,,,,,,,,,,,0,1,Maison,199,6,S,sols,,,795,1.826264,49.428269
2023-782078,2023-01-20,000001,Vente,170000,,,LE VILLAGE,B127,60850,60187,Cuigy-en-Bray,60,,,601870000C0632,,,,,,,,,,,,,0,,,,,PH,herbages,,,1657,1.826339,49.428378
2023-782656,2023-03-22,000001,Vente,178000,1,,RUE DES SOLONS,0063,60850,60187,Cuigy-en-Bray,60,,,601870000C0491,,,,,,,,,,,,,0,1,Maison,84,5,J,jardins,,,662,1.828286,49.43595
2023-782656,2023-03-22,000001,Vente,178000,1,,RUE DES SOLONS,0063,60850,60187,Cuigy-en-Bray,60,,,601870000C0491,,,,,,,,,,,,,0,1,Maison,84,5,S,sols,,,500,1.828286,49.43595
2023-783797,2023-05-15,000001,Vente,5000,,,LE BOIS DES PATIS,B010,60850,60187,Cuigy-en-Bray,60,,,601870000D0446,,,,,,,,,,,,,0,,,,,BS,taillis sous futaie,,,1405,1.82251,49.41963
2023-783805,2023-05-25,000001,Vente,4000,,,LE CHAMP CAILLOUX,B019,60850,60187,Cuigy-en-Bray,60,,,601870000W0119,,,,,,,,,,,,,0,,,,,T,terres,,,1820,1.828362,49.420923
2023-783805,2023-05-25,000001,Vente,4000,,,LE CHAMP CAILLOUX,B019,60850,60187,Cuigy-en-Bray,60,,,601870000W0121,,,,,,,,,,,,,0,,,,,T,terres,,,3035,1.827652,49.42061
2023-784026,2023-06-02,000002,Vente,63800,,,AU DESSOUS DES HERBAGES,B038,60850,60187,Cuigy-en-Bray,60,,,601870000C0640,,,,,,,,,,,,,0,,,,,PH,herbages,,,2365,1.828024,49.436718
2023-784259,2023-06-19,000001,Vente,95000,3,,RUE DE SAINT LEU,0060,60850,60187,Cuigy-en-Bray,60,,,601870000A0918,,,,,,,,,,,,,0,4,Local industriel. commercial ou assimilé,436,0,J,jardins,,,1765,1.821245,49.445385
2023-784259,2023-06-19,000001,Vente,95000,3,,RUE DE SAINT LEU,0060,60850,60187,Cuigy-en-Bray,60,,,601870000A0918,,,,,,,,,,,,,0,4,Local industriel. commercial ou assimilé,436,0,S,sols,,,1461,1.821245,49.445385
2023-784259,2023-06-19,000001,Vente,95000,,,SAINT LEU,B112,60850,60187,Cuigy-en-Bray,60,,,601870000A0922,,,,,,,,,,,,,0,,,,,J,jardins,,,654,1.82171,49.445234
2023-784667,2023-06-30,000001,Vente,125000,20,,RUE DE CALIMONT,0010,60850,60187,Cuigy-en-Bray,60,,,601870000C0257,,,,,,,,,,,,,0,3,Dépendance,,0,S,sols,,,286,1.827194,49.432131
2023-784667,2023-06-30,000001,Vente,125000,20,,RUE DE CALIMONT,0010,60850,60187,Cuigy-en-Bray,60,,,601870000C0257,,,,,,,,,,,,,0,1,Maison,85,3,S,sols,,,286,1.827194,49.432131
2023-784667,2023-06-30,000001,Vente,125000,,,CALIMONT,B017,60850,60187,Cuigy-en-Bray,60,,,601870000C0258,,,,,,,,,,,,,0,,,,,PH,herbages,,,730,1.827396,49.431997
2023-785377,2023-09-04,000001,Vente,4700,,,LE GRAND CHAMP SUD,B067,60850,60187,Cuigy-en-Bray,60,,,601870000Y0179,,,,,,,,,,,,,0,,,,,T,terres,,,3195,1.843884,49.424768
2023-785377,2023-09-04,000001,Vente,4700,,,LE GRAND CHAMP SUD,B067,60850,60187,Cuigy-en-Bray,60,,,601870000Y0179,,,,,,,,,,,,,0,,,,,T,terres,,,3195,1.843884,49.424768
2023-785603,2023-09-06,000001,Vente,70000,10,,RUE DE SAINT LEU,0060,60850,60187,Cuigy-en-Bray,60,,,601870000A0419,,,,,,,,,,,,,0,1,Maison,49,3,S,sols,,,420,1.822097,49.444206
2023-785603,2023-09-06,000001,Vente,70000,10,,RUE DE SAINT LEU,0060,60850,60187,Cuigy-en-Bray,60,,,601870000A0419,,,,,,,,,,,,,0,3,Dépendance,,0,S,sols,,,420,1.822097,49.444206
2023-785603,2023-09-06,000001,Vente,70000,,,SAINT LEU,B112,60850,60187,Cuigy-en-Bray,60,,,601870000A0892,,,,,,,,,,,,,0,,,,,S,sols,,,36,1.822046,49.444411
2023-785699,2023-09-20,000001,Vente,180000,4,,RUE D ESPAUBOURG,0027,60850,60187,Cuigy-en-Bray,60,,,601870000D0548,,,,,,,,,,,,,0,1,Maison,81,3,S,sols,,,1100,1.825211,49.425997
2023-785826,2023-09-25,000001,Vente,50000,,,LE PUITS GYAUDIN,B100,60850,60187,Cuigy-en-Bray,60,,,601870000B0228,,,,,,,,,,,,,0,,,,,PH,herbages,,,2056,1.838359,49.43178
2023-785826,2023-09-25,000001,Vente,50000,,,LE PUITS GYAUDIN,B100,60850,60187,Cuigy-en-Bray,60,,,601870000B0229,,,,,,,,,,,,,0,,,,,PH,herbages,,,1597,1.838324,49.432061
2023-785826,2023-09-25,000001,Vente,50000,,,LE PUITS GYAUDIN,B100,60850,60187,Cuigy-en-Bray,60,,,601870000B0230,,,,,,,,,,,,,0,,,,,PH,herbages,,,1998,1.838398,49.432317
2023-785826,2023-09-25,000001,Vente,50000,,,LE PUITS GYAUDIN,B100,60850,60187,Cuigy-en-Bray,60,,,601870000B0231,,,,,,,,,,,,,0,,,,,PH,herbages,,,1700,1.83854,49.432487
2023-786118,2023-09-29,000001,Vente,165000,281,,LE BOIS DES LARRIS,B006,60850,60187,Cuigy-en-Bray,60,,,601870000D0450,,,,,,,,,,,,,0,1,Maison,72,3,S,sols,,,907,1.821454,49.42027
2023-786168,2023-10-17,000001,Vente,10000,,,LES SOLONS SUD,B115,60850,60187,Cuigy-en-Bray,60,,,601870000C0111,,,,,,,,,,,,,0,,,,,PH,herbages,,,9330,1.829172,49.4355
2023-786375,2023-10-23,000001,Vente,3920,,,LE FOND DE LA HAUTE RUE OU,B057,60850,60187,Cuigy-en-Bray,60,,,601870000Z0516,,,,,,,,,,,,,0,,,,,T,terres,,,6130,1.858936,49.437922
2023-786807,2023-11-28,000001,Vente,32000,,,LE CHAMP ELISABETH,B023,60850,60187,Cuigy-en-Bray,60,,,601870000C0168,,,,,,,,,,,,,0,,,,,PH,herbages,,,997,1.822931,49.432657
2023-786807,2023-11-28,000001,Vente,32000,,,LE CHAMP ELISABETH,B023,60850,60187,Cuigy-en-Bray,60,,,601870000C0168,,,,,,,,,,,,,0,,,,,PH,herbages,,,998,1.822931,49.432657
2023-786807,2023-11-28,000001,Vente,32000,,,LES LARRIS VERS LE COUDRAY,B002,60850,60187,Cuigy-en-Bray,60,,,601870000D0105,,,,,,,,,,,,,0,,,,,T,terres,,,7305,1.828654,49.419716
2023-786807,2023-11-28,000001,Vente,32000,,,LES LARRIS VERS LE COUDRAY,B002,60850,60187,Cuigy-en-Bray,60,,,601870000D0106,,,,,,,,,,,,,0,,,,,BT,taillis simples,,,1590,1.829113,49.419426
2023-786807,2023-11-28,000001,Vente,32000,,,LE CHAMP SAINT MARTIN,B024,60850,60187,Cuigy-en-Bray,60,,,601870000W0007,,,,,,,,,,,,,0,,,,,T,terres,,,12165,1.839715,49.420693
2023-786807,2023-11-28,000001,Vente,32000,,,LE CORNOUILLER,B030,60850,60187,Cuigy-en-Bray,60,,,601870000W0117,,,,,,,,,,,,,0,,,,,T,terres,,,27390,1.829916,49.420076
2023-786807,2023-11-28,000001,Vente,32000,,,LE CHEMIN VERT,B027,60850,60187,Cuigy-en-Bray,60,,,601870000X0013,,,,,,,,,,,,,0,,,,,PH,herbages,,,10575,1.817188,49.434162
2023-786807,2023-11-28,000001,Vente,32000,,,LE CHEMIN VERT,B027,60850,60187,Cuigy-en-Bray,60,,,601870000X0013,,,,,,,,,,,,,0,,,,,T,terres,,,6200,1.817188,49.434162
2023-786807,2023-11-28,000001,Vente,32000,,,LE MOULIN,B082,60850,60187,Cuigy-en-Bray,60,,,601870000X0047,,,,,,,,,,,,,0,,,,,T,terres,,,4515,1.819625,49.434661
2023-786807,2023-11-28,000001,Vente,32000,,,LE MOULIN,B082,60850,60187,Cuigy-en-Bray,60,,,601870000X0047,,,,,,,,,,,,,0,,,,,T,terres,,,4515,1.819625,49.434661
2023-786809,2023-11-27,000001,Vente,179000,18,,RUE DE LA GRIPPE,0037,60850,60187,Cuigy-en-Bray,60,,,601870000B0088,,,,,,,,,,,,,0,3,Dépendance,,0,S,sols,,,394,1.85353,49.429025
2023-786809,2023-11-27,000001,Vente,179000,18,,RUE DE LA GRIPPE,0037,60850,60187,Cuigy-en-Bray,60,,,601870000B0088,,,,,,,,,,,,,0,1,Maison,130,4,S,sols,,,394,1.85353,49.429025
2023-786809,2023-11-27,000001,Vente,179000,,,LES EAUX OUIES,B050,60850,60187,Cuigy-en-Bray,60,,,601870000B0089,,,,,,,,,,,,,0,,,,,S,sols,,,292,1.853554,49.42885
2023-786809,2023-11-27,000001,Vente,179000,,,LES EAUX OUIES,B050,60850,60187,Cuigy-en-Bray,60,,,601870000B0440,,,,,,,,,,,,,0,,,,,PH,herbages,,,208,1.853466,49.429096
2023-786809,2023-11-27,000001,Vente,179000,,,LES EAUX OUIES,B050,60850,60187,Cuigy-en-Bray,60,,,601870000B0443,,,,,,,,,,,,,0,,,,,PH,herbages,,,358,1.853671,49.429186
2023-787232,2023-12-11,000001,Vente,28500,,,LE FOND DU BUYET,B060,60850,60187,Cuigy-en-Bray,60,,,601870000W0092,,,,,,,,,,,,,0,,,,,T,terres,,,30566,1.832107,49.422299
2023-787232,2023-12-11,000001,Vente,28500,,,LE FOND DU BUYET,B060,60850,60187,Cuigy-en-Bray,60,,,601870000W0092,,,,,,,,,,,,,0,,,,,T,terres,,,10189,1.832107,49.422299
2023-787369,2023-12-28,000001,Vente,228000,,,LES LARRIS VERS LE COUDRAY,B002,60850,60187,Cuigy-en-Bray,60,,,601870000D0297,,,,,,,,,,,,,0,,,,,BS,taillis sous futaie,,,2317,1.839927,49.417516
2023-787369,2023-12-28,000001,Vente,228000,,,LES LARRIS VERS LE COUDRAY,B002,60850,60187,Cuigy-en-Bray,60,,,601870000D0298,,,,,,,,,,,,,0,,,,,BS,taillis sous futaie,,,2150,1.838919,49.416754
2023-787369,2023-12-28,000001,Vente,228000,,,LES LARRIS VERS LE COUDRAY,B002,60850,60187,Cuigy-en-Bray,60,,,601870000D0299,,,,,,,,,,,,,0,,,,,BS,taillis sous futaie,,,4810,1.840429,49.417465
2023-787369,2023-12-28,000001,Vente,228000,256,,LES LARRIS VERS LE COUDRAY,B002,60850,60187,Cuigy-en-Bray,60,,,601870000D0300,,,,,,,,,,,,,0,1,Maison,74,3,S,sols,,,500,1.839221,49.416617
2023-787369,2023-12-28,000001,Vente,228000,256,,LES LARRIS VERS LE COUDRAY,B002,60850,60187,Cuigy-en-Bray,60,,,601870000D0300,,,,,,,,,,,,,0,1,Maison,74,3,BS,taillis sous futaie,,,2075,1.839221,49.416617
2023-787389,2023-12-28,000001,Vente,4500,,,LES HEURTS,B074,60850,60187,Cuigy-en-Bray,60,,,601870000B0189,,,,,,,,,,,,,0,,,,,PH,herbages,,,7239,1.848441,49.42694
