id_mutation,date_mutation,numero_disposition,nature_mutation,valeur_fonciere,adresse_numero,adresse_suffixe,adresse_nom_voie,adresse_code_voie,code_postal,code_commune,nom_commune,code_departement,ancien_code_commune,ancien_nom_commune,id_parcelle,ancien_id_parcelle,numero_volume,lot1_numero,lot1_surface_carrez,lot2_numero,lot2_surface_carrez,lot3_numero,lot3_surface_carrez,lot4_numero,lot4_surface_carrez,lot5_numero,lot5_surface_carrez,nombre_lots,code_type_local,type_local,surface_reelle_bati,nombre_pieces_principales,code_nature_culture,nature_culture,code_nature_culture_speciale,nature_culture_speciale,surface_terrain,longitude,latitude
2023-788247,2023-02-07,000001,Vente,3500,2,,RUE DE L'EGLISE,0150,60117,60672,Vez,60,,,606720000B0323,,,,,,,,,,,,,0,1,Maison,135,6,S,sols,,,70,3.002667,49.264427
2023-788247,2023-02-07,000001,Vente,3500,2,,RUE DE L'EGLISE,0150,60117,60672,Vez,60,,,606720000B0323,,,,,,,,,,,,,0,3,Dépendance,,0,S,sols,,,70,3.002667,49.264427
2023-788247,2023-02-07,000001,Vente,3500,,,LE VILLAGE,B069,60117,60672,Vez,60,,,606720000B0325,,,,,,,,,,,,,0,,,,,S,sols,,,154,3.00314,49.26449
2023-788649,2023-03-10,000001,Vente,3454.5,,,LES VIGNES,B068,60117,60672,Vez,60,,,606720000C0277,,,,,,,,,,,,,0,,,,,T,terres,,,520,3.005703,49.261722
2023-788649,2023-03-10,000001,Vente,3454.5,,,LES VIGNES,B068,60117,60672,Vez,60,,,606720000C0297,,,,,,,,,,,,,0,,,,,BP,peupleraies,,,630,3.005864,49.261329
2023-788649,2023-03-10,000001,Vente,3454.5,,,LES VIGNES,B068,60117,60672,Vez,60,,,606720000C0297,,,,,,,,,,,,,0,,,,,J,jardins,POTAG,Jardin potager,2785,3.005864,49.261329
2023-788649,2023-03-10,000001,Vente,3454.5,,,LES VIGNES,B068,60117,60672,Vez,60,,,606720000C0297,,,,,,,,,,,,,0,,,,,S,sols,,,1000,3.005864,49.261329
2023-789645,2023-05-02,000001,Vente,50000,14,,PL DE LA DIME,0140,60117,60672,Vez,60,,,606720000B0318,,,,,,,,,,,,,0,1,Maison,76,3,S,sols,,,115,3.003667,49.262858
2023-789645,2023-05-02,000001,Vente,50000,,,LE VILLAGE,B069,60117,60672,Vez,60,,,606720000B0319,,,,,,,,,,,,,0,,,,,S,sols,,,81,3.003567,49.262794
2023-793654,2023-11-24,000001,Vente,,,,LE MUID SAUCET,B041,60117,60672,Vez,60,,,60672000ZC0002,,,,,,,,,,,,,0,,,,,S,sols,,,4550,3.016348,49.25499
2023-793654,2023-11-24,000001,Vente,,,,LE PUITS A MARNE,B051,60117,60672,Vez,60,,,60672000ZC0008,,,,,,,,,,,,,0,,,,,S,sols,,,5540,3.021543,49.250064
2023-793654,2023-11-24,000001,Vente,,,,LE VAUBAUDRU,B065,60117,60672,Vez,60,,,60672000ZD0003,,,,,,,,,,,,,0,,,,,S,sols,,,2560,3.020735,49.246418
2023-793654,2023-11-24,000001,Vente,,,,LE VAUBAUDRU,B065,60117,60672,Vez,60,,,60672000ZD0005,,,,,,,,,,,,,0,,,,,S,sols,,,5750,3.018098,49.246836
2023-793654,2023-11-24,000001,Vente,,,,LES VINGT ARPENTS DE FONTE,B070,60117,60672,Vez,60,,,60672000ZH0002,,,,,,,,,,,,,0,,,,,S,sols,,,5300,3.00545,49.251075
2023-793978,2023-12-13,000001,Vente,500,,,LA GLORIETTE,B028,60117,60672,Vez,60,,,606720000C0128,,,,,,,,,,,,,0,,,,,BT,taillis simples,,,402,3.019189,49.263369
2023-793978,2023-12-13,000001,Vente,500,,,LA GLORIETTE,B028,60117,60672,Vez,60,,,606720000C0130,,,,,,,,,,,,,0,,,,,BT,taillis simples,,,1207,3.02014,49.264035
2023-793978,2023-12-13,000001,Vente,500,,,LA GLORIETTE,B028,60117,60672,Vez,60,,,606720000C0133,,,,,,,,,,,,,0,,,,,BT,taillis simples,,,220,3.019439,49.264127
2023-794138,2023-12-12,000001,Vente,168000,,,LE PONT,B046,60117,60672,Vez,60,,,606720000A0079,,,,,,,,,,,,,0,,,,,T,terres,,,980,3.005506,49.267225
2023-794138,2023-12-12,000001,Vente,168000,,,LE PONT,B046,60117,60672,Vez,60,,,606720000A0093,,,,,,,,,,,,,0,,,,,T,terres,,,320,3.003442,49.266257
2023-794138,2023-12-12,000001,Vente,168000,,,LE PONT,B046,60117,60672,Vez,60,,,606720000A0101,,,,,,,,,,,,,0,,,,,T,terres,,,1500,3.003797,49.266645
2023-794138,2023-12-12,000001,Vente,168000,,,LES PROUERONS,B050,60117,60672,Vez,60,,,606720000A0174,,,,,,,,,,,,,0,,,,,T,terres,,,1275,3.000139,49.265892
2023-794138,2023-12-12,000001,Vente,168000,,,LES PROUERONS,B050,60117,60672,Vez,60,,,606720000A0180,,,,,,,,,,,,,0,,,,,T,terres,,,2252,3.000393,49.265647
2023-794138,2023-12-12,000001,Vente,168000,,,LES PROUERONS,B050,60117,60672,Vez,60,,,606720000A0183,,,,,,,,,,,,,0,,,,,T,terres,,,6043,3.000181,49.26487
2023-794138,2023-12-12,000001,Vente,168000,,,LE VERT GALANT,B066,60117,60672,Vez,60,,,606720000A0187,,,,,,,,,,,,,0,,,,,T,terres,,,7860,2.997917,49.26425
2023-794138,2023-12-12,000001,Vente,168000,,,LE QUINQUIN,B052,60117,60672,Vez,60,,,606720000A0217,,,,,,,,,,,,,0,,,,,L,landes,FRICH,Friche,969,2.995727,49.264248
2023-794138,2023-12-12,000001,Vente,168000,,,LA SENTE DE LA BOULOIE,B059,60117,60672,Vez,60,,,606720000A0261,,,,,,,,,,,,,0,,,,,T,terres,,,26233,3.007135,49.267837
2023-794138,2023-12-12,000001,Vente,168000,,,LE VERT GALANT,B066,60117,60672,Vez,60,,,606720000A0270,,,,,,,,,,,,,0,,,,,T,terres,,,8017,2.999691,49.264118
2023-794138,2023-12-12,000001,Vente,168000,,,LE VERT GALANT,B066,60117,60672,Vez,60,,,606720000A0272,,,,,,,,,,,,,0,,,,,T,terres,,,1163,2.99898,49.264019
2023-794138,2023-12-12,000001,Vente,168000,,,LE VILLAGE,B069,60117,60672,Vez,60,,,606720000B0019,,,,,,,,,,,,,0,,,,,L,landes,FRICH,Friche,332,3.000464,49.263464
2023-794138,2023-12-12,000001,Vente,168000,,,LE VILLAGE,B069,60117,60672,Vez,60,,,606720000B0020,,,,,,,,,,,,,0,,,,,J,jardins,POTAG,Jardin potager,816,3.000346,49.263606
2023-794138,2023-12-12,000001,Vente,168000,,,LE VILLAGE,B069,60117,60672,Vez,60,,,606720000B0022,,,,,,,,,,,,,0,,,,,T,terres,,,360,3.000292,49.263916
2023-794138,2023-12-12,000001,Vente,168000,,,LE VILLAGE,B069,60117,60672,Vez,60,,,606720000B0030,,,,,,,,,,,,,0,,,,,J,jardins,POTAG,Jardin potager,885,3.00066,49.264048
2023-794138,2023-12-12,000001,Vente,168000,9,,RUE DE LA CROIX REBOURS,0120,60117,60672,Vez,60,,,606720000B0034,,,,,,,,,,,,,0,1,Maison,217,7,S,sols,,,7042,3.001394,49.263889
2023-794138,2023-12-12,000001,Vente,168000,9,,RUE DE LA CROIX REBOURS,0120,60117,60672,Vez,60,,,606720000B0034,,,,,,,,,,,,,0,1,Maison,100,2,S,sols,,,7042,3.001394,49.263889
2023-794138,2023-12-12,000001,Vente,168000,9,,RUE DE LA CROIX REBOURS,0120,60117,60672,Vez,60,,,606720000B0034,,,,,,,,,,,,,0,3,Dépendance,,0,S,sols,,,7042,3.001394,49.263889
2023-794138,2023-12-12,000001,Vente,168000,,,LE VILLAGE,B069,60117,60672,Vez,60,,,606720000B0055,,,,,,,,,,,,,0,,,,,T,terres,,,1120,3.002778,49.265131
2023-794138,2023-12-12,000001,Vente,168000,,,LE VILLAGE,B069,60117,60672,Vez,60,,,606720000B0130,,,,,,,,,,,,,0,,,,,S,sols,,,20,3.002106,49.263696
2023-794138,2023-12-12,000001,Vente,168000,,,LE VILLAGE,B069,60117,60672,Vez,60,,,606720000B0131,,,,,,,,,,,,,0,,,,,J,jardins,POTAG,Jardin potager,1197,3.002101,49.263511
2023-794138,2023-12-12,000001,Vente,168000,,,LE COTI BAILLET,B010,60117,60672,Vez,60,,,606720000B0156,,,,,,,,,,,,,0,,,,,T,terres,,,1545,3.005119,49.261765
2023-794138,2023-12-12,000001,Vente,168000,,,LES OUCHES,B044,60117,60672,Vez,60,,,606720000C0077,,,,,,,,,,,,,0,,,,,T,terres,,,610,3.006232,49.261994
2023-794138,2023-12-12,000001,Vente,168000,,,LES OUCHES,B044,60117,60672,Vez,60,,,606720000C0079,,,,,,,,,,,,,0,,,,,T,terres,,,3275,3.007006,49.262252
2023-794138,2023-12-12,000001,Vente,168000,,,LES OUCHES,B044,60117,60672,Vez,60,,,606720000C0080,,,,,,,,,,,,,0,,,,,T,terres,,,470,3.00816,49.262286
2023-794138,2023-12-12,000001,Vente,168000,,,LE CIMETIERE DES VACHES,B009,60117,60672,Vez,60,,,606720000C0110,,,,,,,,,,,,,0,,,,,L,landes,FRICH,Friche,10907,3.011677,49.262275
2023-794138,2023-12-12,000001,Vente,168000,,,LA RUSETTE,B056,60117,60672,Vez,60,,,606720000C0115,,,,,,,,,,,,,0,,,,,L,landes,FRICH,Friche,3100,3.014332,49.262329
2023-794138,2023-12-12,000001,Vente,168000,,,LA GLORIETTE,B028,60117,60672,Vez,60,,,606720000C0125,,,,,,,,,,,,,0,,,,,BT,taillis simples,,,4592,3.018401,49.263175
2023-794138,2023-12-12,000001,Vente,168000,,,LA GLORIETTE,B028,60117,60672,Vez,60,,,606720000C0126,,,,,,,,,,,,,0,,,,,P,prés,,,3435,3.017327,49.262513
2023-794138,2023-12-12,000001,Vente,168000,,,LA GLORIETTE,B028,60117,60672,Vez,60,,,606720000C0129,,,,,,,,,,,,,0,,,,,BT,taillis simples,,,398,3.019157,49.263411
2023-794138,2023-12-12,000001,Vente,168000,,,CHATILLON,B007,60117,60672,Vez,60,,,606720000C0180,,,,,,,,,,,,,0,,,,,L,landes,FRICH,Friche,6430,3.020921,49.260983
2023-794138,2023-12-12,000001,Vente,168000,,,LE LARRIS FERAGU,B034,60117,60672,Vez,60,,,606720000C0190,,,,,,,,,,,,,0,,,,,BT,taillis simples,,,7023,3.019929,49.263549
2023-794138,2023-12-12,000001,Vente,168000,,,LE GRAND PRE,B029,60117,60672,Vez,60,,,606720000C0192,,,,,,,,,,,,,0,,,,,BT,taillis simples,,,875,3.016803,49.261924
2023-794138,2023-12-12,000001,Vente,168000,,,LE GRAND PRE,B029,60117,60672,Vez,60,,,606720000C0193,,,,,,,,,,,,,0,,,,,T,terres,,,19394,3.015638,49.261447
2023-794138,2023-12-12,000001,Vente,168000,,,LE GRAND PRE,B029,60117,60672,Vez,60,,,606720000C0194,,,,,,,,,,,,,0,,,,,T,terres,,,5970,3.016823,49.260989
2023-794138,2023-12-12,000001,Vente,168000,,,LES VIGNES,B068,60117,60672,Vez,60,,,606720000C0252,,,,,,,,,,,,,0,,,,,T,terres,,,4393,3.009216,49.261565
2023-794138,2023-12-12,000001,Vente,168000,,,LES VIGNES,B068,60117,60672,Vez,60,,,606720000C0254,,,,,,,,,,,,,0,,,,,T,terres,,,215,3.008887,49.26113
2023-794138,2023-12-12,000001,Vente,168000,,,LES VIGNES,B068,60117,60672,Vez,60,,,606720000C0269,,,,,,,,,,,,,0,,,,,T,terres,,,1115,3.00655,49.261393
2023-794138,2023-12-12,000001,Vente,168000,,,HAUTEZET,B031,60117,60672,Vez,60,,,60672000ZA0002,,,,,,,,,,,,,0,,,,,T,terres,,,49175,2.998548,49.26712
2023-794138,2023-12-12,000001,Vente,168000,,,HAUTEZET,B031,60117,60672,Vez,60,,,60672000ZA0002,,,,,,,,,,,,,0,,,,,T,terres,,,98345,2.998548,49.26712
2023-794138,2023-12-12,000001,Vente,168000,,,HAUTEZET,B031,60117,60672,Vez,60,,,60672000ZA0002,,,,,,,,,,,,,0,,,,,T,terres,,,36880,2.998548,49.26712
2023-794138,2023-12-12,000001,Vente,168000,,,LES CHENEVIERES,B008,60117,60672,Vez,60,,,60672000ZA0011,,,,,,,,,,,,,0,,,,,T,terres,,,38938,3.010215,49.271534
2023-794138,2023-12-12,000001,Vente,168000,,,LES CHENEVIERES,B008,60117,60672,Vez,60,,,60672000ZA0011,,,,,,,,,,,,,0,,,,,T,terres,,,175221,3.010215,49.271534
2023-794138,2023-12-12,000001,Vente,168000,,,LES CHENEVIERES,B008,60117,60672,Vez,60,,,60672000ZA0011,,,,,,,,,,,,,0,,,,,T,terres,,,175221,3.010215,49.271534
2023-794138,2023-12-12,000001,Vente,168000,,,LE HAUT DES LAMBURES,B030,60117,60672,Vez,60,,,60672000ZB0019,,,,,,,,,,,,,0,,,,,T,terres,,,319200,3.019085,49.270445
2023-794138,2023-12-12,000001,Vente,168000,,,LE HAUT DES LAMBURES,B030,60117,60672,Vez,60,,,60672000ZB0019,,,,,,,,,,,,,0,,,,,T,terres,,,425600,3.019085,49.270445
2023-794138,2023-12-12,000001,Vente,168000,,,LES CLOS,B035,60117,60672,Vez,60,,,60672000ZB0022,,,,,,,,,,,,,0,,,,,T,terres,,,119655,3.023023,49.266637
2023-794138,2023-12-12,000001,Vente,168000,,,LES CLOS,B035,60117,60672,Vez,60,,,60672000ZB0022,,,,,,,,,,,,,0,,,,,T,terres,,,79770,3.023023,49.266637
2023-794138,2023-12-12,000001,Vente,168000,,,LES CLOS,B035,60117,60672,Vez,60,,,60672000ZB0022,,,,,,,,,,,,,0,,,,,T,terres,,,119655,3.023023,49.266637
2023-794138,2023-12-12,000001,Vente,168000,,,CHATILLON,B007,60117,60672,Vez,60,,,60672000ZB0023,,,,,,,,,,,,,0,,,,,T,terres,,,50290,3.020239,49.262568
2023-794138,2023-12-12,000001,Vente,168000,,,AU DESSUS DE L ARGILLIERE,B014,60117,60672,Vez,60,,,60672000ZB0040,,,,,,,,,,,,,0,,,,,T,terres,,,10000,3.010661,49.266701
2023-794138,2023-12-12,000001,Vente,168000,,,AU DESSUS DE LA RUSETTE,B015,60117,60672,Vez,60,,,60672000ZB0042,,,,,,,,,,,,,0,,,,,T,terres,,,173890,3.013619,49.263754
2023-794493,2023-12-22,000001,Vente,21500,,,LA JUSTICE,B032,60117,60672,Vez,60,,,60672000ZE0014,,,,,,,,,,,,,0,,,,,T,terres,,,4570,3.010025,49.240437
