id_mutation,date_mutation,numero_disposition,nature_mutation,valeur_fonciere,adresse_numero,adresse_suffixe,adresse_nom_voie,adresse_code_voie,code_postal,code_commune,nom_commune,code_departement,ancien_code_commune,ancien_nom_commune,id_parcelle,ancien_id_parcelle,numero_volume,lot1_numero,lot1_surface_carrez,lot2_numero,lot2_surface_carrez,lot3_numero,lot3_surface_carrez,lot4_numero,lot4_surface_carrez,lot5_numero,lot5_surface_carrez,nombre_lots,code_type_local,type_local,surface_reelle_bati,nombre_pieces_principales,code_nature_culture,nature_culture,code_nature_culture_speciale,nature_culture_speciale,surface_terrain,longitude,latitude
2023-825344,2023-01-24,000001,Vente,,,,LACHAUX,B290,63380,63118,Condat-en-Combraille,63,,,63118000BV0175,,,,,,,,,,,,,0,,,,,P,prés,,,388,2.539215,45.857683
2023-825344,2023-01-24,000002,Vente,,,,LACHAUX,B290,63380,63118,Condat-en-Combraille,63,,,63118000BV0043,,,,,,,,,,,,,0,,,,,S,sols,,,425,2.539571,45.857877
2023-825344,2023-01-24,000002,Vente,,5191,,LACHAUX,B290,63380,63118,Condat-en-Combraille,63,,,63118000BV0044,,,,,,,,,,,,,0,1,Maison,150,6,S,sols,,,665,2.539818,45.85781
2023-825344,2023-01-24,000002,Vente,,,,LACHAUX,B290,63380,63118,Condat-en-Combraille,63,,,63118000BV0051,,,,,,,,,,,,,0,,,,,S,sols,,,387,2.539466,45.857611
2023-825344,2023-01-24,000002,Vente,,,,LACHAUX,B290,63380,63118,Condat-en-Combraille,63,,,63118000BV0052,,,,,,,,,,,,,0,,,,,PA,pâtures,,,544,2.539339,45.857423
2023-826031,2023-02-10,000001,Vente,25000,5231,,VEDRINE,B547,63380,63118,Condat-en-Combraille,63,,,63118000YA0043,,,,,,,,,,,,,0,1,Maison,96,5,S,sols,,,611,2.552628,45.830444
2023-826031,2023-02-10,000001,Vente,25000,5231,,VEDRINE,B547,63380,63118,Condat-en-Combraille,63,,,63118000YA0043,,,,,,,,,,,,,0,1,Maison,96,5,P,prés,,,1400,2.552628,45.830444
2023-829199,2023-04-18,000002,Vente,65000,5058,,LE MONTEIX,B338,63380,63118,Condat-en-Combraille,63,,,63118000ZT0062,,,,,,,,,,,,,0,1,Maison,71,4,,,,,,2.56954,45.858152
2023-830319,2023-05-17,000001,Vente,10656,,,L ETANG,B190,63380,63118,Condat-en-Combraille,63,,,63118000AD0034,,,,,,,,,,,,,0,,,,,BR,futaies résineuses,,,4145,2.58137,45.9116
2023-830319,2023-05-17,000001,Vente,10656,,,PUY BATON,B432,63380,63118,Condat-en-Combraille,63,,,63118000AD0055,,,,,,,,,,,,,0,,,,,BR,futaies résineuses,,,15060,2.576846,45.909723
2023-830319,2023-05-17,000001,Vente,10656,,,PUY BATON,B432,63380,63118,Condat-en-Combraille,63,,,63118000AD0055,,,,,,,,,,,,,0,,,,,BT,taillis simples,,,3765,2.576846,45.909723
2023-831368,2023-06-09,000001,Vente,27550,,,LA COU,B152,63380,63118,Condat-en-Combraille,63,,,63118000ZH0052,,,,,,,,,,,,,0,,,,,PA,pâtures,,,28301,2.608147,45.891962
2023-831368,2023-06-09,000001,Vente,27550,,,LA COU,B152,63380,63118,Condat-en-Combraille,63,,,63118000ZH0052,,,,,,,,,,,,,0,,,,,BT,taillis simples,,,1000,2.608147,45.891962
2023-831368,2023-06-09,000001,Vente,27550,,,CHANASSI,B092,63380,63118,Condat-en-Combraille,63,,,63118000ZH0065,,,,,,,,,,,,,0,,,,,PA,pâtures,,,13432,2.596018,45.882646
2023-831368,2023-06-09,000001,Vente,27550,,,LE PETIT LEGER,B388,63380,63118,Condat-en-Combraille,63,,,63118000ZH0077,,,,,,,,,,,,,0,,,,,P,prés,,,3911,2.595079,45.885718
2023-831368,2023-06-09,000001,Vente,27550,,,CHANASSI,B092,63380,63118,Condat-en-Combraille,63,,,63118000ZI0007,,,,,,,,,,,,,0,,,,,T,terres,,,23730,2.598035,45.883824
2023-831368,2023-06-09,000001,Vente,27550,,,CHANASSI,B092,63380,63118,Condat-en-Combraille,63,,,63118000ZI0007,,,,,,,,,,,,,0,,,,,BT,taillis simples,,,5932,2.598035,45.883824
2023-831368,2023-06-09,000001,Vente,27550,,,LE CHEROU,B118,63380,63118,Condat-en-Combraille,63,,,63118000ZK0012,,,,,,,,,,,,,0,,,,,T,terres,,,35518,2.590483,45.881509
2023-832751,2023-07-10,000002,Vente,85500,5102,,LE PETIT LEGER,B388,63380,63118,Condat-en-Combraille,63,,,63118000ZH0085,,,,,,,,,,,,,0,1,Maison,75,3,,,,,,,
2023-833495,2023-07-27,000001,Vente,64000,5124,C,PUY MAURY,B445,63380,63118,Condat-en-Combraille,63,,,63118000AN0171,,,,,,,,,,,,,0,3,Dépendance,,0,S,sols,,,2947,2.575033,45.861182
2023-833495,2023-07-27,000001,Vente,64000,5124,C,PUY MAURY,B445,63380,63118,Condat-en-Combraille,63,,,63118000AN0171,,,,,,,,,,,,,0,1,Maison,95,3,S,sols,,,2947,2.575033,45.861182
2023-834459,2023-08-08,000001,Vente,44670,,,LE BREU,B048,63380,63118,Condat-en-Combraille,63,,,63118000ZH0003,,,,,,,,,,,,,0,,,,,BR,futaies résineuses,,,4339,2.589627,45.889976
2023-834459,2023-08-08,000001,Vente,44670,,,FORTO,B221,63380,63118,Condat-en-Combraille,63,,,63118000ZH0063,,,,,,,,,,,,,0,,,,,T,terres,,,12700,2.596697,45.886771
2023-834459,2023-08-08,000001,Vente,44670,,,FORTO,B221,63380,63118,Condat-en-Combraille,63,,,63118000ZH0063,,,,,,,,,,,,,0,,,,,P,prés,,,18088,2.596697,45.886771
2023-834459,2023-08-08,000001,Vente,44670,,,CHANASSI,B092,63380,63118,Condat-en-Combraille,63,,,63118000ZH0066,,,,,,,,,,,,,0,,,,,BT,taillis simples,,,3334,2.595589,45.881931
2023-834459,2023-08-08,000001,Vente,44670,,,LA GARDE,B238,63380,63118,Condat-en-Combraille,63,,,63118000ZH0080,,,,,,,,,,,,,0,,,,,P,prés,,,36753,2.591616,45.885353
2023-834459,2023-08-08,000001,Vente,44670,,,LE PETIT LEGER,B388,63380,63118,Condat-en-Combraille,63,,,63118000ZH0084,,,,,,,,,,,,,0,,,,,T,terres,,,20000,,
2023-834459,2023-08-08,000001,Vente,44670,,,LE PETIT LEGER,B388,63380,63118,Condat-en-Combraille,63,,,63118000ZH0084,,,,,,,,,,,,,0,,,,,P,prés,,,25628,,
2023-834459,2023-08-08,000001,Vente,44670,,,LACHAMP,B288,63380,63118,Condat-en-Combraille,63,,,63118000ZH0086,,,,,,,,,,,,,0,,,,,PA,pâtures,,,36029,,
2023-834459,2023-08-08,000001,Vente,44670,,,LA COURNADE,B162,63380,63118,Condat-en-Combraille,63,,,63118000ZI0004,,,,,,,,,,,,,0,,,,,L,landes,,,7240,2.595277,45.881032
2023-834459,2023-08-08,000001,Vente,44670,,,LA COURNADE,B162,63380,63118,Condat-en-Combraille,63,,,63118000ZI0004,,,,,,,,,,,,,0,,,,,BR,futaies résineuses,,,19060,2.595277,45.881032
2023-834459,2023-08-08,000001,Vente,44670,,,LA COURNADE,B162,63380,63118,Condat-en-Combraille,63,,,63118000ZI0004,,,,,,,,,,,,,0,,,,,BF,futaies feuillues,,,3290,2.595277,45.881032
2023-834459,2023-08-08,000001,Vente,44670,,,LA COURNADE,B162,63380,63118,Condat-en-Combraille,63,,,63118000ZI0004,,,,,,,,,,,,,0,,,,,BT,taillis simples,,,3290,2.595277,45.881032
2023-834459,2023-08-08,000001,Vente,44670,,,LA COURNADE,B162,63380,63118,Condat-en-Combraille,63,,,63118000ZI0004,,,,,,,,,,,,,0,,,,,T,terres,,,12400,2.595277,45.881032
2023-834459,2023-08-08,000001,Vente,44670,,,LA COURNADE,B162,63380,63118,Condat-en-Combraille,63,,,63118000ZI0004,,,,,,,,,,,,,0,,,,,P,prés,,,32156,2.595277,45.881032
2023-834459,2023-08-08,000001,Vente,44670,,,LA COURNADE,B162,63380,63118,Condat-en-Combraille,63,,,63118000ZI0004,,,,,,,,,,,,,0,,,,,PA,pâtures,,,4280,2.595277,45.881032
2023-835224,2023-09-04,000001,Vente,6000,,,VEDRINE,B547,63380,63118,Condat-en-Combraille,63,,,63118000YA0035,,,,,,,,,,,,,0,,,,,T,terres,,,12596,2.553048,45.827578
2023-836533,2023-10-12,000001,Vente,8000,,,LE MAS GRANDVILLE,B321,63380,63118,Condat-en-Combraille,63,,,63118000BK0084,,,,,,,,,,,,,0,,,,,L,landes,,,19440,2.585526,45.843166
2023-836533,2023-10-12,000001,Vente,8000,,,LE MAS GRANDVILLE,B321,63380,63118,Condat-en-Combraille,63,,,63118000BK0085,,,,,,,,,,,,,0,,,,,PA,pâtures,,,10660,2.585259,45.843309
2023-836533,2023-10-12,000001,Vente,8000,,,LE MAS GRANDVILLE,B321,63380,63118,Condat-en-Combraille,63,,,63118000BK0086,,,,,,,,,,,,,0,,,,,L,landes,,,44280,2.584592,45.843757
2023-836580,2023-10-12,000001,Vente,1000,,,LE MAS GRANDVILLE,B321,63380,63118,Condat-en-Combraille,63,,,63118000BK0076,,,,,,,,,,,,,0,,,,,BR,futaies résineuses,,,7000,2.583058,45.841686
2023-836580,2023-10-12,000001,Vente,1000,,,LE MAS GRANDVILLE,B321,63380,63118,Condat-en-Combraille,63,,,63118000BK0076,,,,,,,,,,,,,0,,,,,BT,taillis simples,,,3000,2.583058,45.841686
2023-837152,2023-10-11,000001,Vente,2200,,,LES CROUZETS,B177,63380,63118,Condat-en-Combraille,63,,,63118000ZR0032,,,,,,,,,,,,,0,,,,,P,prés,,,10599,2.595522,45.854062
2023-837652,2023-09-01,000001,Vente,500,,,LA CHAUMETTE,B109,63380,63118,Condat-en-Combraille,63,,,63118000ZI0070,,,,,,,,,,,,,0,,,,,BF,futaies feuillues,,,427,2.59589,45.877978
2023-837652,2023-09-01,000001,Vente,500,,,LA CHAUMETTE,B109,63380,63118,Condat-en-Combraille,63,,,63118000ZI0071,,,,,,,,,,,,,0,,,,,BF,futaies feuillues,,,172,2.595632,45.877918
2023-838150,2023-11-03,000001,Vente,5000,,,LE CROS,B171,63380,63118,Condat-en-Combraille,63,,,63118000ZE0036,,,,,,,,,,,,,0,,,,,E,eaux,MARE,Mare,1185,2.583685,45.882295
2023-838150,2023-11-03,000001,Vente,5000,,,LE CROS,B171,63380,63118,Condat-en-Combraille,63,,,63118000ZE0036,,,,,,,,,,,,,0,,,,,PA,pâtures,,,2999,2.583685,45.882295
2023-838150,2023-11-03,000001,Vente,5000,,,LE CROS,B171,63380,63118,Condat-en-Combraille,63,,,63118000ZE0036,,,,,,,,,,,,,0,,,,,E,eaux,ETANG,Etangs,1721,2.583685,45.882295
2023-838160,2023-11-15,000001,Vente,6000,,,LAVEIX,B305,63380,63118,Condat-en-Combraille,63,,,63118000BZ0012,,,,,,,,,,,,,0,,,,,BR,futaies résineuses,,,1190,2.533048,45.833832
2023-838160,2023-11-15,000001,Vente,6000,,,LAVEIX,B305,63380,63118,Condat-en-Combraille,63,,,63118000BZ0012,,,,,,,,,,,,,0,,,,,BT,taillis simples,,,1190,2.533048,45.833832
2023-838160,2023-11-15,000001,Vente,6000,,,LAVEIX,B305,63380,63118,Condat-en-Combraille,63,,,63118000BZ0013,,,,,,,,,,,,,0,,,,,BT,taillis simples,,,4165,2.533361,45.833459
2023-838160,2023-11-15,000001,Vente,6000,,,LAVEIX,B305,63380,63118,Condat-en-Combraille,63,,,63118000BZ0013,,,,,,,,,,,,,0,,,,,BR,futaies résineuses,,,3749,2.533361,45.833459
2023-838160,2023-11-15,000001,Vente,6000,,,LAVEIX,B305,63380,63118,Condat-en-Combraille,63,,,63118000BZ0013,,,,,,,,,,,,,0,,,,,B,bois,,,416,2.533361,45.833459
2023-838160,2023-11-15,000001,Vente,6000,,,LAVEIX,B305,63380,63118,Condat-en-Combraille,63,,,63118000BZ0017,,,,,,,,,,,,,0,,,,,BT,taillis simples,,,1860,2.533776,45.832409
2023-838160,2023-11-15,000001,Vente,6000,,,LAVEIX,B305,63380,63118,Condat-en-Combraille,63,,,63118000BZ0017,,,,,,,,,,,,,0,,,,,BR,futaies résineuses,,,1860,2.533776,45.832409
2023-838160,2023-11-15,000001,Vente,6000,,,LES NAUTES,B350,63380,63118,Condat-en-Combraille,63,,,63118000YB0015,,,,,,,,,,,,,0,,,,,PA,pâtures,,,2482,2.532334,45.833401
2023-838901,2023-11-14,000001,Vente,147000,5195,,LACHAUX,B290,63380,63118,Condat-en-Combraille,63,,,63118000BV0146,,,,,,,,,,,,,0,3,Dépendance,,0,S,sols,,,1608,2.540418,45.857355
2023-838901,2023-11-14,000001,Vente,147000,5195,,LACHAUX,B290,63380,63118,Condat-en-Combraille,63,,,63118000BV0146,,,,,,,,,,,,,0,3,Dépendance,,0,S,sols,,,1608,2.540418,45.857355
2023-838901,2023-11-14,000001,Vente,147000,5195,,LACHAUX,B290,63380,63118,Condat-en-Combraille,63,,,63118000BV0146,,,,,,,,,,,,,0,1,Maison,150,4,S,sols,,,1608,2.540418,45.857355
2023-839124,2023-12-06,000001,Vente,1000,,,LES PALLES,B364,63380,63118,Condat-en-Combraille,63,,,63118000ZD0012,,,,,,,,,,,,,0,,,,,BR,futaies résineuses,,,2293,2.559032,45.889878
2023-839124,2023-12-06,000001,Vente,1000,,,LES PALLES,B364,63380,63118,Condat-en-Combraille,63,,,63118000ZD0014,,,,,,,,,,,,,0,,,,,BR,futaies résineuses,,,6321,2.560007,45.889442
2023-839179,2023-12-01,000001,Vente,132150,,,LA GARDE,B238,63380,63118,Condat-en-Combraille,63,,,63118000ZA0061,,,,,,,,,,,,,0,,,,,T,terres,,,1845,2.556267,45.904393
2023-839179,2023-12-01,000001,Vente,132150,,,LA GARDE,B238,63380,63118,Condat-en-Combraille,63,,,63118000ZC0004,,,,,,,,,,,,,0,,,,,PA,pâtures,,,2498,2.556386,45.899429
2023-839612,2023-12-29,000001,Vente,2500,,,PEUVIER,B390,63380,63118,Condat-en-Combraille,63,,,63118000ZA0030,,,,,,,,,,,,,0,,,,,J,jardins,,,538,2.563059,45.90908
