id_mutation,date_mutation,numero_disposition,nature_mutation,valeur_fonciere,adresse_numero,adresse_suffixe,adresse_nom_voie,adresse_code_voie,code_postal,code_commune,nom_commune,code_departement,ancien_code_commune,ancien_nom_commune,id_parcelle,ancien_id_parcelle,numero_volume,lot1_numero,lot1_surface_carrez,lot2_numero,lot2_surface_carrez,lot3_numero,lot3_surface_carrez,lot4_numero,lot4_surface_carrez,lot5_numero,lot5_surface_carrez,nombre_lots,code_type_local,type_local,surface_reelle_bati,nombre_pieces_principales,code_nature_culture,nature_culture,code_nature_culture_speciale,nature_culture_speciale,surface_terrain,longitude,latitude
2023-824149,2023-01-04,000001,Vente,2800,,,BELAIR,B002,63880,63260,Olmet,63,,,63260000AE0277,,,,,,,,,,,,,0,,,,,BF,futaies feuillues,,,13325,3.676749,45.725056
2023-824149,2023-01-04,000001,Vente,2800,,,BELAIR,B002,63880,63260,Olmet,63,,,63260000AE0429,,,,,,,,,,,,,0,,,,,BF,futaies feuillues,,,870,3.677195,45.726008
2023-826743,2023-03-16,000001,Vente,45000,5218,,LA ROCHE,B083,63880,63260,Olmet,63,,,63260000AI0255,,,,,,,,,,,,,0,1,Maison,65,2,S,sols,,,31,3.659885,45.712922
2023-826743,2023-03-16,000001,Vente,45000,5218,,LA ROCHE,B083,63880,63260,Olmet,63,,,63260000AI0255,,,,,,,,,,,,,0,3,Dépendance,,0,S,sols,,,31,3.659885,45.712922
2023-826743,2023-03-16,000001,Vente,45000,,,LA ROCHE,B083,63880,63260,Olmet,63,,,63260000AI0279,,,,,,,,,,,,,0,,,,,L,landes,,,988,3.659769,45.713042
2023-826743,2023-03-16,000001,Vente,45000,,,LA ROCHE,B083,63880,63260,Olmet,63,,,63260000AI0286,,,,,,,,,,,,,0,,,,,P,prés,,,1031,3.660036,45.71295
2023-826743,2023-03-16,000001,Vente,45000,,,LA ROCHE,B083,63880,63260,Olmet,63,,,63260000AI0286,,,,,,,,,,,,,0,,,,,S,sols,,,700,3.660036,45.71295
2023-828621,2023-04-12,000001,Vente,41000,,,LA LITTE NORD,B058,63880,63260,Olmet,63,,,63260000AC0036,,,,,,,,,,,,,0,,,,,BF,futaies feuillues,,,4640,3.666702,45.735581
2023-828621,2023-04-12,000001,Vente,41000,,,LOUMERIE,B060,63880,63260,Olmet,63,,,63260000AC0180,,,,,,,,,,,,,0,,,,,BF,futaies feuillues,,,2155,3.664387,45.732974
2023-828621,2023-04-12,000001,Vente,41000,,,LOUMERIE,B060,63880,63260,Olmet,63,,,63260000AC0181,,,,,,,,,,,,,0,,,,,BF,futaies feuillues,,,1428,3.66479,45.73365
2023-828621,2023-04-12,000001,Vente,41000,,,LOUMERIE,B060,63880,63260,Olmet,63,,,63260000AC0190,,,,,,,,,,,,,0,,,,,BR,futaies résineuses,,,2520,3.664038,45.7357
2023-828621,2023-04-12,000001,Vente,41000,,,LA CHERIE,B025,63880,63260,Olmet,63,,,63260000AC0210,,,,,,,,,,,,,0,,,,,BM,futaies mixtes,,,14000,3.662285,45.740528
2023-828621,2023-04-12,000001,Vente,41000,,,LE GRUN,B050,63880,63260,Olmet,63,,,63260000AD0171,,,,,,,,,,,,,0,,,,,BR,futaies résineuses,PIN,Pins,12319,3.667715,45.726852
2023-828621,2023-04-12,000001,Vente,41000,,,BELAIR,B002,63880,63260,Olmet,63,,,63260000AE0283,,,,,,,,,,,,,0,,,,,BF,futaies feuillues,,,18440,3.675676,45.725254
2023-828621,2023-04-12,000001,Vente,41000,,,LES RONCES,B085,63880,63260,Olmet,63,,,63260000AE0376,,,,,,,,,,,,,0,,,,,BF,futaies feuillues,,,1033,3.674308,45.730435
2023-828621,2023-04-12,000001,Vente,41000,,,LES RONCES,B085,63880,63260,Olmet,63,,,63260000AE0394,,,,,,,,,,,,,0,,,,,BF,futaies feuillues,,,430,3.674379,45.731164
2023-828621,2023-04-12,000001,Vente,41000,,,LES RONCES,B085,63880,63260,Olmet,63,,,63260000AE0400,,,,,,,,,,,,,0,,,,,BF,futaies feuillues,,,694,3.675694,45.73153
2023-828621,2023-04-12,000001,Vente,41000,,,BELLE VUE,B003,63880,63260,Olmet,63,,,63260000AH0005,,,,,,,,,,,,,0,,,,,BM,futaies mixtes,,,2140,3.663267,45.715635
2023-828621,2023-04-12,000001,Vente,41000,,,MAUZUN,B063,63880,63260,Olmet,63,,,63260000AI0057,,,,,,,,,,,,,0,,,,,BR,futaies résineuses,,,2140,3.663928,45.709562
2023-828621,2023-04-12,000001,Vente,41000,,,LE GRUN D OLMET,B051,63880,63260,Olmet,63,,,63260000AK0025,,,,,,,,,,,,,0,,,,,BR,futaies résineuses,,,3280,3.664431,45.709948
2023-828621,2023-04-12,000001,Vente,41000,,,LE GRUN D OLMET,B051,63880,63260,Olmet,63,,,63260000AK0036,,,,,,,,,,,,,0,,,,,BT,taillis simples,,,8200,3.666921,45.709121
2023-828621,2023-04-12,000001,Vente,41000,,,RABALY,B079,63880,63260,Olmet,63,,,63260000AP0091,,,,,,,,,,,,,0,,,,,BM,futaies mixtes,,,6340,3.652342,45.715494
2023-828621,2023-04-12,000001,Vente,41000,,,RABALY,B079,63880,63260,Olmet,63,,,63260000AP0092,,,,,,,,,,,,,0,,,,,BT,taillis simples,,,3170,3.652631,45.716188
2023-828621,2023-04-12,000001,Vente,41000,,,RABALY,B079,63880,63260,Olmet,63,,,63260000AP0095,,,,,,,,,,,,,0,,,,,BM,futaies mixtes,,,2600,3.653217,45.714848
2023-828621,2023-04-12,000001,Vente,41000,,,LES PALLES,B069,63880,63260,Olmet,63,,,63260000AP0110,,,,,,,,,,,,,0,,,,,BT,taillis simples,,,2360,3.655054,45.715748
2023-828621,2023-04-12,000001,Vente,41000,,,LES PALLES,B069,63880,63260,Olmet,63,,,63260000AP0113,,,,,,,,,,,,,0,,,,,BT,taillis simples,,,2500,3.655874,45.716336
2023-828621,2023-04-12,000001,Vente,41000,,,LE BOIS DU BRUN,B006,63880,63260,Olmet,63,,,63260000AR0110,,,,,,,,,,,,,0,,,,,L,landes,,,1245,3.65976,45.71839
2023-828621,2023-04-12,000001,Vente,41000,,,LE BOIS DU BRUN,B006,63880,63260,Olmet,63,,,63260000AR0113,,,,,,,,,,,,,0,,,,,BF,futaies feuillues,,,674,3.66004,45.719886
2023-828621,2023-04-12,000001,Vente,41000,,,LE BOIS DU BRUN,B006,63880,63260,Olmet,63,,,63260000AR0114,,,,,,,,,,,,,0,,,,,BT,taillis simples,,,1200,3.660316,45.718984
2023-828621,2023-04-12,000001,Vente,41000,,,LE BOIS DU BRUN,B006,63880,63260,Olmet,63,,,63260000AR0114,,,,,,,,,,,,,0,,,,,BF,futaies feuillues,,,1200,3.660316,45.718984
2023-828621,2023-04-12,000001,Vente,41000,,,LE BOIS DU BRUN,B006,63880,63260,Olmet,63,,,63260000AR0115,,,,,,,,,,,,,0,,,,,BT,taillis simples,,,2518,3.660662,45.71892
2023-828621,2023-04-12,000001,Vente,41000,,,LE BOIS DU BRUN,B006,63880,63260,Olmet,63,,,63260000AR0115,,,,,,,,,,,,,0,,,,,BF,futaies feuillues,,,2517,3.660662,45.71892
2023-828621,2023-04-12,000001,Vente,41000,,,LE BOIS DU BRUN,B006,63880,63260,Olmet,63,,,63260000AR0116,,,,,,,,,,,,,0,,,,,BF,futaies feuillues,,,903,3.660454,45.719906
2023-828621,2023-04-12,000001,Vente,41000,,,LE BOIS DU BRUN,B006,63880,63260,Olmet,63,,,63260000AR0122,,,,,,,,,,,,,0,,,,,PA,pâtures,,,2650,3.66404,45.720021
2023-828621,2023-04-12,000001,Vente,41000,,,LE BOIS DU BRUN,B006,63880,63260,Olmet,63,,,63260000AR0123,,,,,,,,,,,,,0,,,,,BT,taillis simples,,,50510,3.662061,45.717987
2023-829422,2023-04-17,000002,Vente,3321.5,,,LES FOUGERES,B042,63880,63260,Olmet,63,,,63260000AO0124,,,,,,,,,,,,,0,,,,,BR,futaies résineuses,,,1139,3.650242,45.709598
2023-829422,2023-04-17,000002,Vente,3321.5,,,LAIRE,B054,63880,63260,Olmet,63,,,63260000AO0129,,,,,,,,,,,,,0,,,,,BR,futaies résineuses,,,3310,3.650655,45.711602
2023-829422,2023-04-17,000002,Vente,3321.5,,,LAIRE,B054,63880,63260,Olmet,63,,,63260000AO0129,,,,,,,,,,,,,0,,,,,BT,taillis simples,,,3310,3.650655,45.711602
2023-832260,2023-07-05,000001,Vente,3600,,,LE RODELIER,B084,63880,63260,Olmet,63,,,63260000AO0262,,,,,,,,,,,,,0,,,,,PA,pâtures,,,4202,3.640736,45.707947
2023-832260,2023-07-05,000001,Vente,3600,,,LE RODELIER,B084,63880,63260,Olmet,63,,,63260000AO0271,,,,,,,,,,,,,0,,,,,S,sols,,,91,3.640102,45.706853
2023-832260,2023-07-05,000001,Vente,3600,,,LE RODELIER,B084,63880,63260,Olmet,63,,,63260000AO0272,,,,,,,,,,,,,0,,,,,P,prés,,,2222,3.640244,45.706739
2023-832260,2023-07-05,000001,Vente,3600,,,LE RODELIER,B084,63880,63260,Olmet,63,,,63260000AO0273,,,,,,,,,,,,,0,,,,,T,terres,,,3595,3.640533,45.707021
2023-833142,2023-07-06,000001,Vente,700,,,CROTOLES,B034,63880,63260,Olmet,63,,,63260000AM0141,,,,,,,,,,,,,0,,,,,PA,pâtures,,,11560,3.674649,45.691734
2023-833582,2023-07-12,000001,Vente,1931.4,,,MONTPELLAT,B066,63880,63260,Olmet,63,,,63260000AD0331,,,,,,,,,,,,,0,,,,,P,prés,,,3950,3.659583,45.723044
2023-833582,2023-07-12,000001,Vente,1931.4,,,LES FOUGERES,B042,63880,63260,Olmet,63,,,63260000AO0128,,,,,,,,,,,,,0,,,,,BT,taillis simples,,,8900,3.650169,45.711297
2023-833582,2023-07-12,000001,Vente,1931.4,,,CHAUFFRUT,B023,63880,63260,Olmet,63,,,63260000AP0160,,,,,,,,,,,,,0,,,,,BT,taillis simples,,,2514,3.649732,45.711701
2023-833863,2023-07-24,000001,Vente,100,,,AU VIT,B097,63880,63260,Olmet,63,,,63260000AM0074,,,,,,,,,,,,,0,,,,,L,landes,,,560,3.669885,45.697974
2023-833863,2023-07-24,000001,Vente,100,,,AU VIT,B097,63880,63260,Olmet,63,,,63260000AM0075,,,,,,,,,,,,,0,,,,,BF,futaies feuillues,,,530,3.669887,45.69785
2023-833863,2023-07-24,000001,Vente,100,,,LE SAGNAT,B086,63880,63260,Olmet,63,,,63260000AM0174,,,,,,,,,,,,,0,,,,,T,terres,,,2154,3.669657,45.697572
2023-833870,2023-07-21,000001,Vente,400,,,LEGALLET,B055,63880,63260,Olmet,63,,,63260000AS0141,,,,,,,,,,,,,0,,,,,BF,futaies feuillues,,,3680,3.651953,45.732067
2023-833872,2023-07-21,000001,Vente,2000,,,LE DAROT,B035,63880,63260,Olmet,63,,,63260000AS0021,,,,,,,,,,,,,0,,,,,BT,taillis simples,,,5080,3.645548,45.728065
2023-833872,2023-07-21,000001,Vente,2000,,,LE DAROT,B035,63880,63260,Olmet,63,,,63260000AS0029,,,,,,,,,,,,,0,,,,,BF,futaies feuillues,,,3532,3.646634,45.729964
2023-833872,2023-07-21,000001,Vente,2000,,,LE DAROT,B035,63880,63260,Olmet,63,,,63260000AS0030,,,,,,,,,,,,,0,,,,,BF,futaies feuillues,,,2239,3.64648,45.730325
2023-834174,2023-07-26,000001,Vente,140000,,,BOULEYRAS,B008,63880,63260,Olmet,63,,,63260000AL0207,,,,,,,,,,,,,0,,,,,PA,pâtures,,,4860,3.681235,45.704986
2023-834174,2023-07-26,000001,Vente,140000,,,BOULEYRAS,B008,63880,63260,Olmet,63,,,63260000AL0211,,,,,,,,,,,,,0,,,,,BT,taillis simples,,,78,3.682012,45.704417
2023-834174,2023-07-26,000001,Vente,140000,3,,BOULEYRAS,B008,63880,63260,Olmet,63,,,63260000AL0212,,,,,,,,,,,,,0,3,Dépendance,,0,PA,pâtures,,,4880,3.681429,45.704351
2023-834174,2023-07-26,000001,Vente,140000,3,,BOULEYRAS,B008,63880,63260,Olmet,63,,,63260000AL0212,,,,,,,,,,,,,0,3,Dépendance,,0,S,sols,,,1000,3.681429,45.704351
2023-834174,2023-07-26,000001,Vente,140000,,,BOULEYRAS,B008,63880,63260,Olmet,63,,,63260000AL0228,,,,,,,,,,,,,0,,,,,P,prés,,,300,3.680852,45.704172
2023-834174,2023-07-26,000001,Vente,140000,,,BOULEYRAS,B008,63880,63260,Olmet,63,,,63260000AL0230,,,,,,,,,,,,,0,,,,,L,landes,,,15,3.680643,45.704264
2023-834174,2023-07-26,000001,Vente,140000,5092,,BOULEYRAS,B008,63880,63260,Olmet,63,,,63260000AL0231,,,,,,,,,,,,,0,1,Maison,105,3,S,sols,,,148,3.680708,45.704339
2023-835032,2023-08-28,000001,Vente,20000,,,LE BOURG,B009,63880,63260,Olmet,63,,,63260000AI0192,,,,,,,,,,,,,0,,,,,J,jardins,,,77,3.661708,45.710257
2023-835032,2023-08-28,000001,Vente,20000,,,LE BOURG,B009,63880,63260,Olmet,63,,,63260000AI0193,,,,,,,,,,,,,0,,,,,J,jardins,,,102,3.661764,45.710192
2023-835032,2023-08-28,000001,Vente,20000,5151,,LE BOURG,B009,63880,63260,Olmet,63,,,63260000AI0194,,,1,,2,,,,,,,,2,1,Maison,70,4,,,,,,3.66172,45.710169
2023-836248,2023-10-05,000002,Echange,300,,,MONTPELLAT,B066,63880,63260,Olmet,63,,,63260000AD0338,,,,,,,,,,,,,0,,,,,P,prés,,,1109,3.662653,45.723177
2023-836248,2023-10-05,000003,Echange,300,,,MONTPELLAT,B066,63880,63260,Olmet,63,,,63260000AD0336,,,,,,,,,,,,,0,,,,,S,sols,,,60,3.662917,45.72351
2023-836248,2023-10-05,000003,Echange,300,,,MONTPELLAT,B066,63880,63260,Olmet,63,,,63260000AD0339,,,,,,,,,,,,,0,,,,,P,prés,,,437,3.662723,45.723541
2023-836504,2023-10-09,000001,Vente,3200,5220,,A LA COTE,B031,63880,63260,Olmet,63,,,63260000AI0070,,,,,,,,,,,,,0,1,Maison,40,2,S,sols,,,26,3.664092,45.708339
2023-836504,2023-10-09,000001,Vente,3200,,,A LA COTE,B031,63880,63260,Olmet,63,,,63260000AI0071,,,,,,,,,,,,,0,,,,,S,sols,,,500,3.66418,45.708231
2023-836504,2023-10-09,000001,Vente,3200,,,A LA COTE,B031,63880,63260,Olmet,63,,,63260000AI0071,,,,,,,,,,,,,0,,,,,J,jardins,,,140,3.66418,45.708231
2023-836504,2023-10-09,000001,Vente,3200,,,A LA COTE,B031,63880,63260,Olmet,63,,,63260000AI0072,,,,,,,,,,,,,0,,,,,BR,futaies résineuses,,,400,3.663956,45.708147
2023-837549,2023-10-10,000001,Vente,87120,,,LE SAGNAT,B086,63880,63260,Olmet,63,,,63260000AM0015,,,,,,,,,,,,,0,,,,,P,prés,,,6480,3.67111,45.697015
2023-837549,2023-10-10,000001,Vente,87120,5143,,LA PLANCHE DU FOND,B098,63880,63260,Olmet,63,,,63260000AM0017,,,,,,,,,,,,,0,3,Dépendance,,0,S,sols,,,840,3.670135,45.697171
2023-837549,2023-10-10,000001,Vente,87120,5143,,LA PLANCHE DU FOND,B098,63880,63260,Olmet,63,,,63260000AM0017,,,,,,,,,,,,,0,1,Maison,125,5,S,sols,,,840,3.670135,45.697171
2023-837549,2023-10-10,000001,Vente,87120,,,LE SAGNAT,B086,63880,63260,Olmet,63,,,63260000AM0018,,,,,,,,,,,,,0,,,,,J,jardins,,,800,3.670093,45.696918
2023-837549,2023-10-10,000001,Vente,87120,,,LE SAGNAT,B086,63880,63260,Olmet,63,,,63260000AM0019,,,,,,,,,,,,,0,,,,,P,prés,,,8580,3.669834,45.696774
2023-837549,2023-10-10,000001,Vente,87120,,,LE SAGNAT,B086,63880,63260,Olmet,63,,,63260000AM0019,,,,,,,,,,,,,0,,,,,PA,pâtures,,,4290,3.669834,45.696774
2023-837549,2023-10-10,000001,Vente,87120,,,LE SAGNAT,B086,63880,63260,Olmet,63,,,63260000AM0173,,,,,,,,,,,,,0,,,,,T,terres,,,2094,3.670452,45.697311
2023-838016,2023-11-08,000001,Vente,500,,,CHARLANDAIS,B021,63880,63260,Olmet,63,,,63260000AE0234,,,,,,,,,,,,,0,,,,,BT,taillis simples,,,1058,3.681097,45.723603
2023-839322,2023-12-14,000001,Vente,1500,,,MONTGUILLET,B065,63880,63260,Olmet,63,,,63260000AD0122,,,,,,,,,,,,,0,,,,,BF,futaies feuillues,,,7530,3.668088,45.729929
2023-839322,2023-12-14,000001,Vente,1500,,,MONTGUILLET,B065,63880,63260,Olmet,63,,,63260000AD0124,,,,,,,,,,,,,0,,,,,BF,futaies feuillues,,,1397,3.668405,45.729253
