id_mutation,date_mutation,numero_disposition,nature_mutation,valeur_fonciere,adresse_numero,adresse_suffixe,adresse_nom_voie,adresse_code_voie,code_postal,code_commune,nom_commune,code_departement,ancien_code_commune,ancien_nom_commune,id_parcelle,ancien_id_parcelle,numero_volume,lot1_numero,lot1_surface_carrez,lot2_numero,lot2_surface_carrez,lot3_numero,lot3_surface_carrez,lot4_numero,lot4_surface_carrez,lot5_numero,lot5_surface_carrez,nombre_lots,code_type_local,type_local,surface_reelle_bati,nombre_pieces_principales,code_nature_culture,nature_culture,code_nature_culture_speciale,nature_culture_speciale,surface_terrain,longitude,latitude
2023-854973,2023-01-09,000001,Vente,3420,,,LACAOUBERE,B025,65330,65097,Bonrepos,65,,,650970000A0082,,,,,,,,,,,,,0,,,,,T,terres,,,6840,0.370554,43.201555
2023-855007,2023-01-16,000001,Vente,1100,,,LACASTAGNERE,B028,65330,65097,Bonrepos,65,,,650970000B0049,,,,,,,,,,,,,0,,,,,T,terres,,,2200,0.378191,43.199155
2023-856415,2023-03-17,000001,Vente,300,,,PONTIC,B053,65330,65097,Bonrepos,65,,,650970000C0068,,,,,,,,,,,,,0,,,,,BF,futaies feuillues,,,950,0.365969,43.198949
2023-856415,2023-03-17,000001,Vente,300,,,PONTIC,B053,65330,65097,Bonrepos,65,,,650970000C0069,,,,,,,,,,,,,0,,,,,BT,taillis simples,,,2100,0.366277,43.198997
2023-856453,2023-04-06,000001,Vente,430000,75,,CHEM DU PICHARROT,1750,65330,65097,Bonrepos,65,,,650970000C0503,,,,,,,,,,,,,0,3,Dépendance,,0,S,sols,,,1030,0.371832,43.191526
2023-856453,2023-04-06,000001,Vente,430000,75,,CHEM DU PICHARROT,1750,65330,65097,Bonrepos,65,,,650970000C0503,,,,,,,,,,,,,0,1,Maison,170,4,S,sols,,,1030,0.371832,43.191526
2023-856453,2023-04-06,000001,Vente,430000,75,,CHEM DU PICHARROT,1750,65330,65097,Bonrepos,65,,,650970000C0503,,,,,,,,,,,,,0,2,Appartement,76,2,S,sols,,,1030,0.371832,43.191526
2023-856453,2023-04-06,000001,Vente,430000,75,,CHEM DU PICHARROT,1750,65330,65097,Bonrepos,65,,,650970000C0503,,,,,,,,,,,,,0,2,Appartement,48,2,S,sols,,,1030,0.371832,43.191526
2023-856453,2023-04-06,000001,Vente,430000,75,,CHEM DU PICHARROT,1750,65330,65097,Bonrepos,65,,,650970000C0503,,,,,,,,,,,,,0,3,Dépendance,,0,S,sols,,,1030,0.371832,43.191526
2023-856453,2023-04-06,000001,Vente,430000,75,,CHEM DU PICHARROT,1750,65330,65097,Bonrepos,65,,,650970000C0503,,,,,,,,,,,,,0,3,Dépendance,,0,S,sols,,,1030,0.371832,43.191526
2023-856453,2023-04-06,000001,Vente,430000,,,PICHARROT,B052,65330,65097,Bonrepos,65,,,650970000C0504,,,,,,,,,,,,,0,,,,,J,jardins,,,530,0.371718,43.191441
2023-856453,2023-04-06,000001,Vente,430000,,,PICHARROT,B052,65330,65097,Bonrepos,65,,,650970000C0505,,,,,,,,,,,,,0,,,,,P,prés,,,9420,0.372534,43.191313
2023-856740,2023-04-04,000001,Vente,3630,,,PONTIC,B053,65330,65097,Bonrepos,65,,,650970000C0054,,,,,,,,,,,,,0,,,,,T,terres,,,1645,0.369513,43.198011
2023-856740,2023-04-04,000001,Vente,3630,,,PONTIC,B053,65330,65097,Bonrepos,65,,,650970000C0055,,,,,,,,,,,,,0,,,,,T,terres,,,1600,0.369221,43.19842
2023-856740,2023-04-04,000001,Vente,3630,,,PONTIC,B053,65330,65097,Bonrepos,65,,,650970000C0056,,,,,,,,,,,,,0,,,,,T,terres,,,1915,0.369103,43.198024
2023-856740,2023-04-04,000001,Vente,3630,,,PONTIC,B053,65330,65097,Bonrepos,65,,,650970000C0057,,,,,,,,,,,,,0,,,,,T,terres,,,440,0.369142,43.197797
2023-856740,2023-04-04,000001,Vente,3630,,,PONTIC,B053,65330,65097,Bonrepos,65,,,650970000C0058,,,,,,,,,,,,,0,,,,,P,prés,,,830,0.368899,43.197676
2023-856740,2023-04-04,000001,Vente,3630,,,PONTIC,B053,65330,65097,Bonrepos,65,,,650970000C0062,,,,,,,,,,,,,0,,,,,T,terres,,,1635,0.368796,43.198099
2023-856740,2023-04-04,000001,Vente,3630,,,PONTIC,B053,65330,65097,Bonrepos,65,,,650970000C0076,,,,,,,,,,,,,0,,,,,BT,taillis simples,,,2320,0.370247,43.19894
2023-857119,2023-04-20,000001,Vente,4000,,,BUSTOS,B007,65330,65097,Bonrepos,65,,,650970000A0178,,,,,,,,,,,,,0,,,,,T,terres,,,7035,0.376046,43.199857
2023-858325,2023-07-06,000001,Vente,700,,,PONTIC,B053,65330,65097,Bonrepos,65,,,650970000C0053,,,,,,,,,,,,,0,,,,,T,terres,,,1621,0.36983,43.198107
2023-858545,2023-07-25,000001,Vente,55000,,,LAGOUTERE,B030,65330,65097,Bonrepos,65,,,650970000D0120,,,,,,,,,,,,,0,,,,,S,sols,,,472,0.391947,43.182475
2023-859494,2023-09-07,000001,Vente,260000,209,,CHEM DE PADOUEN,1650,65330,65097,Bonrepos,65,,,650970000C0152,,,,,,,,,,,,,0,1,Maison,163,5,S,sols,,,1005,0.374858,43.194241
2023-859494,2023-09-07,000001,Vente,260000,,,HAIL,B022,65330,65097,Bonrepos,65,,,650970000C0155,,,,,,,,,,,,,0,,,,,J,jardins,,,910,0.374788,43.194663
2023-859494,2023-09-07,000001,Vente,260000,,,HAIL,B022,65330,65097,Bonrepos,65,,,650970000C0791,,,,,,,,,,,,,0,,,,,T,terres,,,229,0.3746,43.194381
2023-859494,2023-09-07,000001,Vente,260000,,,HAIL,B022,65330,65097,Bonrepos,65,,,650970000C0807,,,,,,,,,,,,,0,,,,,S,sols,,,1000,0.374965,43.194324
2023-859494,2023-09-07,000001,Vente,260000,,,HAIL,B022,65330,65097,Bonrepos,65,,,650970000C0807,,,,,,,,,,,,,0,,,,,P,prés,,,2904,0.374965,43.194324
2023-859758,2023-09-12,000002,Vente,38500,,,LAMULATERE,B031,65330,65097,Bonrepos,65,,,650970000C0820,,,,,,,,,,,,,0,,,,,T,terres,,,3499,0.372281,43.196121
