id_mutation,date_mutation,numero_disposition,nature_mutation,valeur_fonciere,adresse_numero,adresse_suffixe,adresse_nom_voie,adresse_code_voie,code_postal,code_commune,nom_commune,code_departement,ancien_code_commune,ancien_nom_commune,id_parcelle,ancien_id_parcelle,numero_volume,lot1_numero,lot1_surface_carrez,lot2_numero,lot2_surface_carrez,lot3_numero,lot3_surface_carrez,lot4_numero,lot4_surface_carrez,lot5_numero,lot5_surface_carrez,nombre_lots,code_type_local,type_local,surface_reelle_bati,nombre_pieces_principales,code_nature_culture,nature_culture,code_nature_culture_speciale,nature_culture_speciale,surface_terrain,longitude,latitude
2023-909246,2023-01-19,000001,Vente,30000,,,CHAMP D OGNON,B004,70300,70213,Éhuns,70,,,70213000ZC0161,,,,,,,,,,,,,0,,,,,AB,terrains a bâtir,,,806,6.31574,47.769476
2023-910511,2023-04-07,000001,Vente,67000,8,,RUE DE LA FONTAINE,0009,70300,70213,Éhuns,70,,,70213000AA0091,,,,,,,,,,,,,0,1,Maison,70,3,S,sols,,,500,6.31374,47.773119
2023-910511,2023-04-07,000001,Vente,67000,8,,RUE DE LA FONTAINE,0009,70300,70213,Éhuns,70,,,70213000AA0091,,,,,,,,,,,,,0,1,Maison,70,3,P,prés,,,1158,6.31374,47.773119
2023-910511,2023-04-07,000001,Vente,67000,,,LE VILLAGE,B044,70300,70213,Éhuns,70,,,70213000AA0092,,,,,,,,,,,,,0,,,,,P,prés,,,924,6.313867,47.773373
2023-910511,2023-04-07,000001,Vente,67000,,,LE VILLAGE,B044,70300,70213,Éhuns,70,,,70213000AA0167,,,,,,,,,,,,,0,,,,,S,sols,,,86,6.313913,47.772925
2023-910551,2023-04-13,000001,Vente,55000,34,,VOIE DU MOULIN,B045,70300,70213,Éhuns,70,,,70213000AA0069,,,,,,,,,,,,,0,1,Maison,102,4,S,sols,,,664,6.311495,47.773356
2023-912279,2023-07-20,000001,Vente,500,,,SUR LES VIGNES,B055,70300,70213,Éhuns,70,,,70213000YA0091,,,,,,,,,,,,,0,,,,,BT,taillis simples,,,650,6.299216,47.765235
2023-912282,2023-07-20,000001,Vente,150,,,SUR LES VIGNES,B055,70300,70213,Éhuns,70,,,70213000YA0090,,,,,,,,,,,,,0,,,,,BT,taillis simples,,,655,6.299065,47.765083
2023-912298,2023-07-20,000001,Vente,710,,,SUR LES VIGNES,B055,70300,70213,Éhuns,70,,,70213000YA0088,,,,,,,,,,,,,0,,,,,BT,taillis simples,,,1418,6.299436,47.764928
2023-912301,2023-07-20,000001,Vente,1500,,,SUR LES VIGNES,B055,70300,70213,Éhuns,70,,,70213000YA0089,,,,,,,,,,,,,0,,,,,BT,taillis simples,,,6580,6.299613,47.765292
2023-913333,2023-10-03,000001,Vente,246400,10,,IMP IMPASSE DU PAUTET,0022,70300,70213,Éhuns,70,,,70213000AA0234,,,,,,,,,,,,,0,3,Dépendance,,0,AB,terrains a bâtir,,,929,6.313426,47.769444
2023-913333,2023-10-03,000001,Vente,246400,10,,IMP IMPASSE DU PAUTET,0022,70300,70213,Éhuns,70,,,70213000AA0234,,,,,,,,,,,,,0,1,Maison,168,6,AB,terrains a bâtir,,,929,6.313426,47.769444
2023-913333,2023-10-03,000001,Vente,246400,10,,IMP IMPASSE DU PAUTET,0022,70300,70213,Éhuns,70,,,70213000AA0234,,,,,,,,,,,,,0,3,Dépendance,,0,AB,terrains a bâtir,,,929,6.313426,47.769444
2023-913333,2023-10-03,000001,Vente,246400,,,CHAMP D OGNON,B004,70300,70213,Éhuns,70,,,70213000AA0243,,,,,,,,,,,,,0,,,,,AB,terrains a bâtir,,,32,6.313259,47.769535
2023-913613,2023-10-11,000001,Vente,4500,,,LES VIGNES DE LA BROSSE,B053,70300,70213,Éhuns,70,,,70213000YA0045,,,,,,,,,,,,,0,,,,,BT,taillis simples,,,780,6.298544,47.76145
2023-913613,2023-10-11,000001,Vente,4500,,,LES VIGNES DE LA BROSSE,B053,70300,70213,Éhuns,70,,,70213000YA0046,,,,,,,,,,,,,0,,,,,BT,taillis simples,,,15682,6.29854,47.760767
2023-913613,2023-10-11,000001,Vente,4500,,,LES VIGNES DE LA BROSSE,B053,70300,70213,Éhuns,70,,,70213000YA0047,,,,,,,,,,,,,0,,,,,BT,taillis simples,,,2813,6.29889,47.75978
2023-913613,2023-10-11,000001,Vente,4500,,,LES VIGNES DE LA BROSSE,B053,70300,70213,Éhuns,70,,,70213000YA0048,,,,,,,,,,,,,0,,,,,BT,taillis simples,,,1470,6.298731,47.759426
