id_mutation,date_mutation,numero_disposition,nature_mutation,valeur_fonciere,adresse_numero,adresse_suffixe,adresse_nom_voie,adresse_code_voie,code_postal,code_commune,nom_commune,code_departement,ancien_code_commune,ancien_nom_commune,id_parcelle,ancien_id_parcelle,numero_volume,lot1_numero,lot1_surface_carrez,lot2_numero,lot2_surface_carrez,lot3_numero,lot3_surface_carrez,lot4_numero,lot4_surface_carrez,lot5_numero,lot5_surface_carrez,nombre_lots,code_type_local,type_local,surface_reelle_bati,nombre_pieces_principales,code_nature_culture,nature_culture,code_nature_culture_speciale,nature_culture_speciale,surface_terrain,longitude,latitude
2023-910147,2023-03-08,000001,Vente,700,,,A GIRATERCEY,B037,70800,70315,Magnoncourt,70,,,703150000B0529,,,,,,,,,,,,,0,,,,,P,prés,,,2550,6.278708,47.895969
2023-910329,2023-03-31,000002,Vente,50,4,,CHEMIN NOIR,0080,70800,70315,Magnoncourt,70,,,703150000A0919,,,,,,,,,,,,,0,,,,,S,sols,,,2,6.291813,47.894815
2023-910329,2023-03-31,000002,Vente,50,,,LES PLANCHES,B056,70800,70315,Magnoncourt,70,,,703150000A0920,,,,,,,,,,,,,0,,,,,J,jardins,,,9,6.291984,47.894699
2023-910587,2023-04-19,000001,Vente,155588,8,,RUE DES VOSGES,0150,70800,70315,Magnoncourt,70,,,70315000AB0172,,,,,,,,,,,,,0,3,Dépendance,,0,S,sols,,,808,6.286452,47.894724
2023-910587,2023-04-19,000001,Vente,155588,8,,RUE DES VOSGES,0150,70800,70315,Magnoncourt,70,,,70315000AB0172,,,,,,,,,,,,,0,3,Dépendance,,0,S,sols,,,808,6.286452,47.894724
2023-910587,2023-04-19,000001,Vente,155588,8,,RUE DES VOSGES,0150,70800,70315,Magnoncourt,70,,,70315000AB0172,,,,,,,,,,,,,0,1,Maison,88,5,S,sols,,,808,6.286452,47.894724
2023-910587,2023-04-19,000001,Vente,155588,,,LES CHENEVIERES 1ER CANTON,B020,70800,70315,Magnoncourt,70,,,70315000AB0240,,,,,,,,,,,,,0,,,,,T,terres,,,571,6.28628,47.894575
2023-910587,2023-04-19,000001,Vente,155588,,,LES CHENEVIERES 1ER CANTON,B020,70800,70315,Magnoncourt,70,,,70315000AB0243,,,,,,,,,,,,,0,,,,,T,terres,,,378,6.286207,47.894502
2023-910587,2023-04-19,000001,Vente,155588,,,LES CHENEVIERES 1ER CANTON,B020,70800,70315,Magnoncourt,70,,,70315000AB0273,,,,,,,,,,,,,0,,,,,S,sols,,,20,6.286577,47.894551
2023-910587,2023-04-19,000001,Vente,155588,,,LES CHENEVIERES 1ER CANTON,B020,70800,70315,Magnoncourt,70,,,70315000AB0357,,,,,,,,,,,,,0,,,,,T,terres,,,107,6.286326,47.894654
2023-910587,2023-04-19,000001,Vente,155588,,,LES CHENEVIERES 1ER CANTON,B020,70800,70315,Magnoncourt,70,,,70315000AB0561,,,,,,,,,,,,,0,,,,,T,terres,,,517,6.286614,47.894454
2023-911097,2023-04-26,000001,Vente,115000,9,,CHE DE FONTENOY,0040,70800,70315,Magnoncourt,70,,,70315000AB0718,,,,,,,,,,,,,0,1,Maison,93,5,J,jardins,,,752,6.286922,47.897369
2023-911097,2023-04-26,000001,Vente,115000,9,,CHE DE FONTENOY,0040,70800,70315,Magnoncourt,70,,,70315000AB0718,,,,,,,,,,,,,0,1,Maison,93,5,S,sols,,,1000,6.286922,47.897369
2023-911097,2023-04-26,000001,Vente,115000,,,CHAMPS DU MONT,B011,70800,70315,Magnoncourt,70,,,70315000AB0719,,,,,,,,,,,,,0,,,,,S,sols,,,63,6.287307,47.897667
2023-913443,2023-09-19,000001,Vente,142000,22,,RUE CHAMPS DU MONT,0075,70800,70315,Magnoncourt,70,,,70315000AB0625,,,,,,,,,,,,,0,1,Maison,129,5,J,jardins,,,35,6.287258,47.896091
2023-913443,2023-09-19,000001,Vente,142000,22,,RUE CHAMPS DU MONT,0075,70800,70315,Magnoncourt,70,,,70315000AB0625,,,,,,,,,,,,,0,1,Maison,129,5,S,sols,,,1152,6.287258,47.896091
2023-913443,2023-09-19,000001,Vente,142000,,,CHAMPS DU MONT,B011,70800,70315,Magnoncourt,70,,,70315000AB0626,,,,,,,,,,,,,0,,,,,T,terres,,,27,6.287132,47.896251
2023-914425,2023-12-08,000001,Vente,30000,,,LE VILLAGE,B086,70800,70315,Magnoncourt,70,,,70315000AB0013,,,,,,,,,,,,,0,,,,,J,jardins,,,167,6.287746,47.892674
2023-914425,2023-12-08,000001,Vente,30000,9,,RUE DE LA GAUGUILLOTTE,0050,70800,70315,Magnoncourt,70,,,70315000AB0023,,,,,,,,,,,,,0,3,Dépendance,,0,S,sols,,,75,6.287918,47.892814
2023-914425,2023-12-08,000001,Vente,30000,9,,RUE DE LA GAUGUILLOTTE,0050,70800,70315,Magnoncourt,70,,,70315000AB0023,,,,,,,,,,,,,0,1,Maison,68,3,S,sols,,,75,6.287918,47.892814
2023-914425,2023-12-08,000001,Vente,30000,,,LE VILLAGE,B086,70800,70315,Magnoncourt,70,,,70315000AB0433,,,,,,,,,,,,,0,,,,,S,sols,,,5,6.287871,47.892769
2023-914425,2023-12-08,000001,Vente,30000,,,LE VILLAGE,B086,70800,70315,Magnoncourt,70,,,70315000AB0434,,,,,,,,,,,,,0,,,,,S,sols,,,10,6.287934,47.892768
