id_mutation,date_mutation,numero_disposition,nature_mutation,valeur_fonciere,adresse_numero,adresse_suffixe,adresse_nom_voie,adresse_code_voie,code_postal,code_commune,nom_commune,code_departement,ancien_code_commune,ancien_nom_commune,id_parcelle,ancien_id_parcelle,numero_volume,lot1_numero,lot1_surface_carrez,lot2_numero,lot2_surface_carrez,lot3_numero,lot3_surface_carrez,lot4_numero,lot4_surface_carrez,lot5_numero,lot5_surface_carrez,nombre_lots,code_type_local,type_local,surface_reelle_bati,nombre_pieces_principales,code_nature_culture,nature_culture,code_nature_culture_speciale,nature_culture_speciale,surface_terrain,longitude,latitude
2023-991184,2023-01-04,000001,Vente,24000,,,LE VILLAGE,B009,76450,76032,Auberville-la-Manuel,76,,,760320000A0469,,,,,,,,,,,,,0,,,,,P,prés,,,21778,0.590914,49.829099
2023-991843,2023-02-23,000001,Vente,110000,17,,RUE ROCQUIGNY,0070,76450,76032,Auberville-la-Manuel,76,,,760320000A0409,,,,,,,,,,,,,0,3,Dépendance,,0,S,sols,,,688,0.592564,49.827659
2023-991843,2023-02-23,000001,Vente,110000,17,,RUE ROCQUIGNY,0070,76450,76032,Auberville-la-Manuel,76,,,760320000A0409,,,,,,,,,,,,,0,3,Dépendance,,0,S,sols,,,688,0.592564,49.827659
2023-991843,2023-02-23,000001,Vente,110000,17,,RUE ROCQUIGNY,0070,76450,76032,Auberville-la-Manuel,76,,,760320000A0409,,,,,,,,,,,,,0,1,Maison,63,4,S,sols,,,688,0.592564,49.827659
2023-991843,2023-02-23,000001,Vente,110000,17,,RUE ROCQUIGNY,0070,76450,76032,Auberville-la-Manuel,76,,,760320000A0409,,,,,,,,,,,,,0,1,Maison,32,2,S,sols,,,688,0.592564,49.827659
2023-992004,2023-03-24,000001,Vente,259500,7,,RUE DU MARRONNIER,0060,76450,76032,Auberville-la-Manuel,76,,,760320000A0357,,,,,,,,,,,,,0,3,Dépendance,,0,VE,vergers,CIDRE,Cidre,3020,0.593869,49.826247
2023-992004,2023-03-24,000001,Vente,259500,7,,RUE DU MARRONNIER,0060,76450,76032,Auberville-la-Manuel,76,,,760320000A0357,,,,,,,,,,,,,0,1,Maison,102,4,S,sols,,,500,0.593869,49.826247
2023-992004,2023-03-24,000001,Vente,259500,7,,RUE DU MARRONNIER,0060,76450,76032,Auberville-la-Manuel,76,,,760320000A0357,,,,,,,,,,,,,0,3,Dépendance,,0,S,sols,,,500,0.593869,49.826247
2023-992004,2023-03-24,000001,Vente,259500,7,,RUE DU MARRONNIER,0060,76450,76032,Auberville-la-Manuel,76,,,760320000A0357,,,,,,,,,,,,,0,3,Dépendance,,0,S,sols,,,500,0.593869,49.826247
2023-992004,2023-03-24,000001,Vente,259500,7,,RUE DU MARRONNIER,0060,76450,76032,Auberville-la-Manuel,76,,,760320000A0357,,,,,,,,,,,,,0,3,Dépendance,,0,VE,vergers,CIDRE,Cidre,3020,0.593869,49.826247
2023-992004,2023-03-24,000001,Vente,259500,7,,RUE DU MARRONNIER,0060,76450,76032,Auberville-la-Manuel,76,,,760320000A0357,,,,,,,,,,,,,0,1,Maison,102,4,VE,vergers,CIDRE,Cidre,3020,0.593869,49.826247
2023-994857,2023-07-13,000001,Vente,242000,,,LE VILLAGE,B009,76450,76032,Auberville-la-Manuel,76,,,760320000A0231,,,,,,,,,,,,,0,,,,,T,terres,,,880,0.592116,49.829822
2023-994857,2023-07-13,000001,Vente,242000,7,T,RUE DE VEULETTES,0095,76450,76032,Auberville-la-Manuel,76,,,760320000A0527,,,,,,,,,,,,,0,1,Maison,119,6,S,sols,,,500,0.592433,49.829643
2023-994857,2023-07-13,000001,Vente,242000,7,T,RUE DE VEULETTES,0095,76450,76032,Auberville-la-Manuel,76,,,760320000A0527,,,,,,,,,,,,,0,1,Maison,119,6,T,terres,,,823,0.592433,49.829643
2023-994857,2023-07-13,000001,Vente,242000,7,T,RUE DE VEULETTES,0095,76450,76032,Auberville-la-Manuel,76,,,760320000A0528,,,,,,,,,,,,,0,,,,,T,terres,,,1078,0.591925,49.829782
2023-998365,2023-12-15,000001,Vente,45000,,,LE VILLAGE,B009,76450,76032,Auberville-la-Manuel,76,,,760320000A0229,,,,,,,,,,,,,0,,,,,J,jardins,,,390,0.592259,49.828751
2023-998365,2023-12-15,000001,Vente,45000,3,,RUE DE VEULETTES,0095,76450,76032,Auberville-la-Manuel,76,,,760320000A0530,,,,,,,,,,,,,0,,,,,T,terres,,,577,0.592158,49.828981
