id_mutation,date_mutation,numero_disposition,nature_mutation,valeur_fonciere,adresse_numero,adresse_suffixe,adresse_nom_voie,adresse_code_voie,code_postal,code_commune,nom_commune,code_departement,ancien_code_commune,ancien_nom_commune,id_parcelle,ancien_id_parcelle,numero_volume,lot1_numero,lot1_surface_carrez,lot2_numero,lot2_surface_carrez,lot3_numero,lot3_surface_carrez,lot4_numero,lot4_surface_carrez,lot5_numero,lot5_surface_carrez,nombre_lots,code_type_local,type_local,surface_reelle_bati,nombre_pieces_principales,code_nature_culture,nature_culture,code_nature_culture_speciale,nature_culture_speciale,surface_terrain,longitude,latitude
2023-990787,2023-01-16,000001,Vente,550000,32,,ALL DES TISSERANDS,0093,76190,76041,Les Hauts-de-Caux,76,,,76041000ZC0054,,,,,,,,,,,,,0,3,Dépendance,,0,S,sols,,,139,0.724124,49.654637
2023-990787,2023-01-16,000001,Vente,550000,32,,ALL DES TISSERANDS,0093,76190,76041,Les Hauts-de-Caux,76,,,76041000ZC0054,,,,,,,,,,,,,0,1,Maison,207,8,S,sols,,,139,0.724124,49.654637
2023-990787,2023-01-16,000001,Vente,550000,,,L EGLISE AUTRETOT,B004,76190,76041,Les Hauts-de-Caux,76,,,76041000ZC0310,,,,,,,,,,,,,0,,,,,VE,vergers,CIDRE,Cidre,1065,0.724164,49.654527
2023-990787,2023-01-16,000001,Vente,550000,,,L EGLISE AUTRETOT,B004,76190,76041,Les Hauts-de-Caux,76,,,76041000ZC0642,,,,,,,,,,,,,0,,,,,VE,vergers,CIDRE,Cidre,2230,0.724141,49.654703
2023-990787,2023-01-16,000001,Vente,550000,,,L EGLISE AUTRETOT,B004,76190,76041,Les Hauts-de-Caux,76,,,76041000ZC0642,,,,,,,,,,,,,0,,,,,S,sols,,,500,0.724141,49.654703
2023-991045,2023-01-25,000001,Vente,230000,,,L EGLISE VEAUVILLE BAONS,B024,76190,76041,Les Hauts-de-Caux,76,,,76041729AI0171,,,,,,,,,,,,,0,,,,,VE,vergers,CIDRE,Cidre,273,0.763266,49.655561
2023-991045,2023-01-25,000001,Vente,230000,,,L EGLISE VEAUVILLE BAONS,B024,76190,76041,Les Hauts-de-Caux,76,,,76041729AI0172,,,,,,,,,,,,,0,,,,,VE,vergers,CIDRE,Cidre,498,0.763116,49.655529
2023-991045,2023-01-25,000001,Vente,230000,94,,RTE DE HOUDETOT,0210,76190,76041,Les Hauts-de-Caux,76,,,76041729AI0206,,,,,,,,,,,,,0,3,Dépendance,,0,S,sols,,,500,0.762991,49.655388
2023-991045,2023-01-25,000001,Vente,230000,94,,RTE DE HOUDETOT,0210,76190,76041,Les Hauts-de-Caux,76,,,76041729AI0206,,,,,,,,,,,,,0,3,Dépendance,,0,S,sols,,,500,0.762991,49.655388
2023-991045,2023-01-25,000001,Vente,230000,94,,RTE DE HOUDETOT,0210,76190,76041,Les Hauts-de-Caux,76,,,76041729AI0206,,,,,,,,,,,,,0,1,Maison,89,5,J,jardins,,,949,0.762991,49.655388
2023-991045,2023-01-25,000001,Vente,230000,94,,RTE DE HOUDETOT,0210,76190,76041,Les Hauts-de-Caux,76,,,76041729AI0206,,,,,,,,,,,,,0,3,Dépendance,,0,J,jardins,,,949,0.762991,49.655388
2023-991045,2023-01-25,000001,Vente,230000,94,,RTE DE HOUDETOT,0210,76190,76041,Les Hauts-de-Caux,76,,,76041729AI0206,,,,,,,,,,,,,0,3,Dépendance,,0,J,jardins,,,949,0.762991,49.655388
2023-991045,2023-01-25,000001,Vente,230000,94,,RTE DE HOUDETOT,0210,76190,76041,Les Hauts-de-Caux,76,,,76041729AI0206,,,,,,,,,,,,,0,1,Maison,89,5,S,sols,,,500,0.762991,49.655388
2023-991898,2023-03-08,000002,Vente,660000,2,,RUE DU PUITS,0218,76190,76041,Les Hauts-de-Caux,76,,,76041729AI0247,,,,,,,,,,,,,0,4,Local industriel. commercial ou assimilé,,0,,,,,,0.76216,49.65508
2023-991972,2023-03-14,000001,Vente,5106,,,LA PLAINE DE LA CROIX BLAN,B034,76190,76041,Les Hauts-de-Caux,76,,,76041729ZH0031,,,,,,,,,,,,,0,,,,,P,prés,,,3404,0.776553,49.65565
2023-992573,2023-04-03,000002,Vente,214000,17,,ALL DES TISSERANDS,0093,76190,76041,Les Hauts-de-Caux,76,,,76041000ZC0784,,,,,,,,,,,,,0,3,Dépendance,,0,,,,,,0.725928,49.653335
2023-992573,2023-04-03,000002,Vente,214000,17,,ALL DES TISSERANDS,0093,76190,76041,Les Hauts-de-Caux,76,,,76041000ZC0784,,,,,,,,,,,,,0,1,Maison,129,3,,,,,,0.725928,49.653335
2023-992573,2023-04-03,000002,Vente,214000,17,,ALL DES TISSERANDS,0093,76190,76041,Les Hauts-de-Caux,76,,,76041000ZC0784,,,,,,,,,,,,,0,1,Maison,61,2,,,,,,0.725928,49.653335
2023-992595,2023-03-29,000001,Vente,10000,,,LE MOULIN,B031,76190,76041,Les Hauts-de-Caux,76,,,76041729AI0004,,,,,,,,,,,,,0,,,,,P,prés,,,8500,0.767436,49.661882
2023-992941,2023-04-25,000001,Vente,55347,,,LA FOSSE A L HOMME,B007,76190,76041,Les Hauts-de-Caux,76,,,76041000ZD0019,,,,,,,,,,,,,0,,,,,T,terres,,,55347,0.730543,49.659737
2023-994679,2023-06-30,000001,Vente,124000,1,B,SEN DU CIMETIERE,0026,76190,76041,Les Hauts-de-Caux,76,,,76041000ZC0731,,,,,,,,,,,,,0,1,Maison,80,4,S,sols,,,500,0.726548,49.649546
2023-994679,2023-06-30,000001,Vente,124000,1,B,SEN DU CIMETIERE,0026,76190,76041,Les Hauts-de-Caux,76,,,76041000ZC0731,,,,,,,,,,,,,0,1,Maison,80,4,J,jardins,,,662,0.726548,49.649546
2023-995149,2023-07-26,000001,Vente,59000,6,,ALL DU TEMPLE,0088,76190,76041,Les Hauts-de-Caux,76,,,76041000ZC0779,,,,,,,,,,,,,0,,,,,AB,terrains a bâtir,,,884,0.723154,49.655366
2023-995170,2023-07-18,000001,Vente,265175,3,,IMP DES ECUREUILS,0031,76190,76041,Les Hauts-de-Caux,76,,,76041000ZC0702,,,,,,,,,,,,,0,1,Maison,90,4,J,jardins,,,800,0.72614,49.655656
2023-995170,2023-07-18,000001,Vente,265175,3,,IMP DES ECUREUILS,0031,76190,76041,Les Hauts-de-Caux,76,,,76041000ZC0702,,,,,,,,,,,,,0,1,Maison,90,4,S,sols,,,500,0.72614,49.655656
2023-995398,2023-08-01,000001,Vente,47500,14,,ALL DU TEMPLE,0088,76190,76041,Les Hauts-de-Caux,76,,,76041000ZC0775,,,,,,,,,,,,,0,,,,,AB,terrains a bâtir,,,793,0.722883,49.655961
2023-995648,2023-08-10,000001,Vente,23200,,,LA SENTE DU FAY,B040,76190,76041,Les Hauts-de-Caux,76,,,76041729ZD0015,,,,,,,,,,,,,0,,,,,T,terres,,,23128,0.756942,49.650603
2023-995740,2023-08-04,000001,Vente,65000,1,,ALL DU TEMPLE,0088,76190,76041,Les Hauts-de-Caux,76,,,76041000ZC0762,,,,,,,,,,,,,0,,,,,AB,terrains a bâtir,,,1005,0.723179,49.654917
2023-995755,2023-08-11,000001,Vente,336440,11,,ALL DES CHENES,0025,76190,76041,Les Hauts-de-Caux,76,,,76041000ZC0536,,,,,,,,,,,,,0,3,Dépendance,,0,S,sols,,,500,0.727527,49.653043
2023-995755,2023-08-11,000001,Vente,336440,11,,ALL DES CHENES,0025,76190,76041,Les Hauts-de-Caux,76,,,76041000ZC0536,,,,,,,,,,,,,0,1,Maison,153,5,S,sols,,,500,0.727527,49.653043
2023-995755,2023-08-11,000001,Vente,336440,11,,ALL DES CHENES,0025,76190,76041,Les Hauts-de-Caux,76,,,76041000ZC0536,,,,,,,,,,,,,0,1,Maison,153,5,J,jardins,,,648,0.727527,49.653043
2023-995755,2023-08-11,000001,Vente,336440,11,,ALL DES CHENES,0025,76190,76041,Les Hauts-de-Caux,76,,,76041000ZC0536,,,,,,,,,,,,,0,3,Dépendance,,0,J,jardins,,,648,0.727527,49.653043
2023-995755,2023-08-11,000001,Vente,336440,11,,ALL DES CHENES,0025,76190,76041,Les Hauts-de-Caux,76,,,76041000ZC0681,,,,,,,,,,,,,0,,,,,S,sols,,,73,0.727641,49.653259
2023-997101,2023-10-23,000001,Vente,221300,141,,RUE DE LA CROIX ROUGE,0204,76190,76041,Les Hauts-de-Caux,76,,,76041729AB0252,,,,,,,,,,,,,0,3,Dépendance,,0,S,sols,,,91,0.761689,49.651467
2023-997101,2023-10-23,000001,Vente,221300,141,,RUE DE LA CROIX ROUGE,0204,76190,76041,Les Hauts-de-Caux,76,,,76041729AB0252,,,,,,,,,,,,,0,1,Maison,94,3,J,jardins,,,686,0.761689,49.651467
2023-997101,2023-10-23,000001,Vente,221300,141,,RUE DE LA CROIX ROUGE,0204,76190,76041,Les Hauts-de-Caux,76,,,76041729AB0252,,,,,,,,,,,,,0,3,Dépendance,,0,J,jardins,,,686,0.761689,49.651467
2023-997101,2023-10-23,000001,Vente,221300,141,,RUE DE LA CROIX ROUGE,0204,76190,76041,Les Hauts-de-Caux,76,,,76041729AB0252,,,,,,,,,,,,,0,1,Maison,94,3,S,sols,,,91,0.761689,49.651467
2023-997114,2023-09-27,000001,Vente,54000,3,,ALL DU TEMPLE,0088,76190,76041,Les Hauts-de-Caux,76,,,76041000ZC0763,,,,,,,,,,,,,0,,,,,AB,terrains a bâtir,,,838,0.723436,49.655071
2023-997245,2023-10-20,000001,Vente,222500,494,,RUE DU GRAND CAPTOT,0209,76190,76041,Les Hauts-de-Caux,76,,,76041729ZI0023,,,,,,,,,,,,,0,1,Maison,110,4,VE,vergers,CIDRE,Cidre,1712,0.786128,49.65231
2023-997245,2023-10-20,000001,Vente,222500,494,,RUE DU GRAND CAPTOT,0209,76190,76041,Les Hauts-de-Caux,76,,,76041729ZI0023,,,,,,,,,,,,,0,1,Maison,110,4,S,sols,,,168,0.786128,49.65231
2023-997588,2023-10-18,000001,Vente,54000,4,,ALL DU TEMPLE,0088,76190,76041,Les Hauts-de-Caux,76,,,76041000ZC0780,,,,,,,,,,,,,0,,,,,AB,terrains a bâtir,,,882,0.722981,49.655192
2023-997832,2023-10-31,000001,Vente,48000,10,,ALL DU TEMPLE,0088,76190,76041,Les Hauts-de-Caux,76,,,76041000ZC0777,,,,,,,,,,,,,0,,,,,AB,terrains a bâtir,,,636,0.723128,49.655737
2023-998083,2023-11-13,000001,Vente,1500,,,L EGLISE AUTRETOT,B004,76190,76041,Les Hauts-de-Caux,76,,,76041000ZC0783,,,,,,,,,,,,,0,,,,,AB,terrains a bâtir,,,224,0.722729,49.656391
2023-998585,2023-12-08,000001,Vente,177000,168,,RUE DE LA CROIX BLANCHE,0202,76190,76041,Les Hauts-de-Caux,76,,,76041729AB0441,,,,,,,,,,,,,0,1,Maison,70,4,J,jardins,,,640,0.768009,49.651941
2023-998585,2023-12-08,000001,Vente,177000,168,,RUE DE LA CROIX BLANCHE,0202,76190,76041,Les Hauts-de-Caux,76,,,76041729AB0441,,,,,,,,,,,,,0,1,Maison,70,4,S,sols,,,500,0.768009,49.651941
2023-998668,2023-12-28,000001,Vente,310000,,,LE CHATEAU,B020,76190,76041,Les Hauts-de-Caux,76,,,76041729AI0101,,,,,,,,,,,,,0,,,,,BF,futaies feuillues,,,1337,0.761741,49.656196
2023-998668,2023-12-28,000001,Vente,310000,,,LE CHATEAU,B020,76190,76041,Les Hauts-de-Caux,76,,,76041729AI0102,,,,,,,,,,,,,0,,,,,BF,futaies feuillues,,,5486,0.761558,49.656684
2023-998668,2023-12-28,000001,Vente,310000,,,LE CHATEAU,B020,76190,76041,Les Hauts-de-Caux,76,,,76041729AI0107,,,,,,,,,,,,,0,,,,,J,jardins,,,1799,0.760692,49.656078
2023-998668,2023-12-28,000001,Vente,310000,,,LE CHATEAU,B020,76190,76041,Les Hauts-de-Caux,76,,,76041729AI0108,,,,,,,,,,,,,0,,,,,P,prés,,,1986,0.760994,49.656636
2023-998668,2023-12-28,000001,Vente,310000,,,LE CHATEAU,B020,76190,76041,Les Hauts-de-Caux,76,,,76041729AI0109,,,,,,,,,,,,,0,,,,,P,prés,,,2313,0.761493,49.657219
2023-998668,2023-12-28,000001,Vente,310000,,,L EGLISE VEAUVILLE BAONS,B024,76190,76041,Les Hauts-de-Caux,76,,,76041729AI0171,,,,,,,,,,,,,0,,,,,VE,vergers,CIDRE,Cidre,273,0.763266,49.655561
2023-998668,2023-12-28,000001,Vente,310000,,,L EGLISE VEAUVILLE BAONS,B024,76190,76041,Les Hauts-de-Caux,76,,,76041729AI0172,,,,,,,,,,,,,0,,,,,VE,vergers,CIDRE,Cidre,498,0.763116,49.655529
2023-998668,2023-12-28,000001,Vente,310000,94,,RTE DE HOUDETOT,0210,76190,76041,Les Hauts-de-Caux,76,,,76041729AI0206,,,,,,,,,,,,,0,3,Dépendance,,0,J,jardins,,,949,0.762991,49.655388
2023-998668,2023-12-28,000001,Vente,310000,94,,RTE DE HOUDETOT,0210,76190,76041,Les Hauts-de-Caux,76,,,76041729AI0206,,,,,,,,,,,,,0,1,Maison,89,5,J,jardins,,,949,0.762991,49.655388
2023-998668,2023-12-28,000001,Vente,310000,94,,RTE DE HOUDETOT,0210,76190,76041,Les Hauts-de-Caux,76,,,76041729AI0206,,,,,,,,,,,,,0,3,Dépendance,,0,J,jardins,,,949,0.762991,49.655388
2023-998668,2023-12-28,000001,Vente,310000,94,,RTE DE HOUDETOT,0210,76190,76041,Les Hauts-de-Caux,76,,,76041729AI0206,,,,,,,,,,,,,0,3,Dépendance,,0,S,sols,,,500,0.762991,49.655388
2023-998668,2023-12-28,000001,Vente,310000,94,,RTE DE HOUDETOT,0210,76190,76041,Les Hauts-de-Caux,76,,,76041729AI0206,,,,,,,,,,,,,0,1,Maison,89,5,S,sols,,,500,0.762991,49.655388
2023-998668,2023-12-28,000001,Vente,310000,94,,RTE DE HOUDETOT,0210,76190,76041,Les Hauts-de-Caux,76,,,76041729AI0206,,,,,,,,,,,,,0,3,Dépendance,,0,S,sols,,,500,0.762991,49.655388
2023-998668,2023-12-28,000001,Vente,310000,,,LE CHATEAU,B020,76190,76041,Les Hauts-de-Caux,76,,,76041729AI0236,,,,,,,,,,,,,0,,,,,VE,vergers,CIDRE,Cidre,4833,0.761988,49.655907
2023-998668,2023-12-28,000001,Vente,310000,184,,RUE DU PUITS,0218,76190,76041,Les Hauts-de-Caux,76,,,76041729AI0249,,,,,,,,,,,,,0,,,,,P,prés,,,4776,0.760792,49.655738
2023-998668,2023-12-28,000001,Vente,310000,184,,RUE DU PUITS,0218,76190,76041,Les Hauts-de-Caux,76,,,76041729AI0249,,,,,,,,,,,,,0,,,,,VE,vergers,CIDRE,Cidre,691,0.760792,49.655738
2023-998696,2023-12-20,000001,Vente,30000,,,LA PRAIRIE,B038,76190,76041,Les Hauts-de-Caux,76,,,76041729ZH0002,,,,,,,,,,,,,0,,,,,P,prés,,,4920,0.763975,49.647095
2023-998696,2023-12-20,000001,Vente,30000,,,LA PRAIRIE,B038,76190,76041,Les Hauts-de-Caux,76,,,76041729ZH0002,,,,,,,,,,,,,0,,,,,P,prés,,,6504,0.763975,49.647095
