id_mutation,date_mutation,numero_disposition,nature_mutation,valeur_fonciere,adresse_numero,adresse_suffixe,adresse_nom_voie,adresse_code_voie,code_postal,code_commune,nom_commune,code_departement,ancien_code_commune,ancien_nom_commune,id_parcelle,ancien_id_parcelle,numero_volume,lot1_numero,lot1_surface_carrez,lot2_numero,lot2_surface_carrez,lot3_numero,lot3_surface_carrez,lot4_numero,lot4_surface_carrez,lot5_numero,lot5_surface_carrez,nombre_lots,code_type_local,type_local,surface_reelle_bati,nombre_pieces_principales,code_nature_culture,nature_culture,code_nature_culture_speciale,nature_culture_speciale,surface_terrain,longitude,latitude
2023-978418,2023-03-11,000001,Vente,44500,,,FOND DU VAL,B021,76260,76619,Saint-Martin-le-Gaillard,76,,,76619000AK0037,,,,,,,,,,,,,0,,,,,P,prés,,,4630,1.367867,49.971179
2023-978418,2023-03-11,000001,Vente,44500,,,FOND DU VAL,B021,76260,76619,Saint-Martin-le-Gaillard,76,,,76619000AK0038,,,,,,,,,,,,,0,,,,,L,landes,,,4300,1.368237,49.970969
2023-978418,2023-03-11,000001,Vente,44500,,,LE MONT DE GRON,B027,76260,76619,Saint-Martin-le-Gaillard,76,,,76619000AP0160,,,,,,,,,,,,,0,,,,,P,prés,,,9565,1.370659,49.974667
2023-978418,2023-03-11,000001,Vente,44500,,,LE MONT DE GRON,B027,76260,76619,Saint-Martin-le-Gaillard,76,,,76619000AP0167,,,,,,,,,,,,,0,,,,,P,prés,,,7635,1.367984,49.972686
2023-978418,2023-03-11,000001,Vente,44500,,,LE MONT DE GRON,B027,76260,76619,Saint-Martin-le-Gaillard,76,,,76619000AP0168,,,,,,,,,,,,,0,,,,,P,prés,,,14325,1.368799,49.974195
2023-978418,2023-03-11,000001,Vente,44500,,,LE MONT DE GRON,B027,76260,76619,Saint-Martin-le-Gaillard,76,,,76619000AP0169,,,,,,,,,,,,,0,,,,,T,terres,,,10780,1.370799,49.975524
2023-978418,2023-03-11,000001,Vente,44500,,,LE MONT DE GRON,B027,76260,76619,Saint-Martin-le-Gaillard,76,,,76619000AP0169,,,,,,,,,,,,,0,,,,,T,terres,,,10780,1.370799,49.975524
2023-978618,2023-02-14,000001,Vente,18225,,,SAINT SULPICE,B045,76260,76619,Saint-Martin-le-Gaillard,76,,,76619000AR0056,,,,,,,,,,,,,0,,,,,P,prés,,,20385,1.351846,49.990975
2023-978618,2023-02-14,000001,Vente,18225,,,SAINT SULPICE,B045,76260,76619,Saint-Martin-le-Gaillard,76,,,76619000AR0057,,,,,,,,,,,,,0,,,,,P,prés,,,16065,1.35135,49.989594
2023-979838,2023-03-25,000001,Vente,205000,12,,RUE DU TOST,0061,76260,76619,Saint-Martin-le-Gaillard,76,,,76619000AD0224,,,,,,,,,,,,,0,1,Maison,152,5,AG,terrains d'agrément,,,1500,1.377713,49.986894
2023-979838,2023-03-25,000001,Vente,205000,12,,RUE DU TOST,0061,76260,76619,Saint-Martin-le-Gaillard,76,,,76619000AD0224,,,,,,,,,,,,,0,1,Maison,152,5,S,sols,,,858,1.377713,49.986894
2023-980276,2023-04-05,000001,Vente,630000,,,LE BOIS COLIN,B003,76260,76619,Saint-Martin-le-Gaillard,76,,,76619000ZA0034,,,,,,,,,,,,,0,,,,,T,terres,,,1391,1.365823,49.940484
2023-980276,2023-04-05,000001,Vente,630000,,,PLAINE DE CUVERVILLE,B035,76260,76619,Saint-Martin-le-Gaillard,76,,,76619000ZB0031,,,,,,,,,,,,,0,,,,,T,terres,,,5643,1.373987,49.951641
2023-982523,2023-06-07,000001,Vente,988.2,,,MONT D ETOCQUIGNY,B026,76260,76619,Saint-Martin-le-Gaillard,76,,,76619000ZL0032,,,,,,,,,,,,,0,,,,,BS,taillis sous futaie,,,1647,1.374654,49.98947
2023-982523,2023-06-07,000001,Vente,988.2,,,MONT D ETOCQUIGNY,B026,76260,76619,Saint-Martin-le-Gaillard,76,,,76619000ZL0032,,,,,,,,,,,,,0,,,,,L,landes,,,1647,1.374654,49.98947
2023-982736,2023-06-08,000001,Vente,204500,1,,RUE DU TOST,0061,76260,76619,Saint-Martin-le-Gaillard,76,,,76619000AD0222,,,,,,,,,,,,,0,3,Dépendance,,0,S,sols,,,92,1.378696,49.988301
2023-982736,2023-06-08,000001,Vente,204500,1,,RUE DU TOST,0061,76260,76619,Saint-Martin-le-Gaillard,76,,,76619000AD0222,,,,,,,,,,,,,0,3,Dépendance,,0,S,sols,,,92,1.378696,49.988301
2023-982736,2023-06-08,000001,Vente,204500,1,,RUE DU TOST,0061,76260,76619,Saint-Martin-le-Gaillard,76,,,76619000AD0222,,,,,,,,,,,,,0,1,Maison,90,3,P,prés,,,2125,1.378696,49.988301
2023-982736,2023-06-08,000001,Vente,204500,1,,RUE DU TOST,0061,76260,76619,Saint-Martin-le-Gaillard,76,,,76619000AD0222,,,,,,,,,,,,,0,3,Dépendance,,0,P,prés,,,2125,1.378696,49.988301
2023-982736,2023-06-08,000001,Vente,204500,1,,RUE DU TOST,0061,76260,76619,Saint-Martin-le-Gaillard,76,,,76619000AD0222,,,,,,,,,,,,,0,1,Maison,90,3,S,sols,,,92,1.378696,49.988301
2023-982736,2023-06-08,000001,Vente,204500,1,,RUE DU TOST,0061,76260,76619,Saint-Martin-le-Gaillard,76,,,76619000AD0222,,,,,,,,,,,,,0,3,Dépendance,,0,P,prés,,,2125,1.378696,49.988301
2023-985839,2023-08-25,000001,Vente,61300,,,BOIS DE LA VALLEE TOURNEE,B005,76260,76619,Saint-Martin-le-Gaillard,76,,,76619000ZH0021,,,,,,,,,,,,,0,,,,,T,terres,,,23140,1.375578,50.001943
2023-985839,2023-08-25,000001,Vente,61300,,,BOIS DE LA VALLEE TOURNEE,B005,76260,76619,Saint-Martin-le-Gaillard,76,,,76619000ZH0021,,,,,,,,,,,,,0,,,,,P,prés,,,28840,1.375578,50.001943
2023-985839,2023-08-25,000001,Vente,61300,,,BOIS DE LA VALLEE TOURNEE,B005,76260,76619,Saint-Martin-le-Gaillard,76,,,76619000ZH0025,,,,,,,,,,,,,0,,,,,P,prés,,,3300,1.374467,50.001347
2023-985839,2023-08-25,000001,Vente,61300,,,BOIS DE LA VALLEE TOURNEE,B005,76260,76619,Saint-Martin-le-Gaillard,76,,,76619000ZH0025,,,,,,,,,,,,,0,,,,,T,terres,,,8700,1.374467,50.001347
2023-986128,2023-09-22,000001,Vente,415000,4,,RUE DU PONT DE L YERES,0068,76260,76619,Saint-Martin-le-Gaillard,76,,,76619000AP0212,,,,,,,,,,,,,0,1,Maison,222,7,S,sols,,,1000,1.373635,49.977935
2023-986128,2023-09-22,000001,Vente,415000,4,,RUE DU PONT DE L YERES,0068,76260,76619,Saint-Martin-le-Gaillard,76,,,76619000AP0212,,,,,,,,,,,,,0,1,Maison,222,7,VE,vergers,,,18910,1.373635,49.977935
2023-987654,2023-10-28,000001,Vente,240000,,,LA PLAINE DU TOST,B042,76260,76619,Saint-Martin-le-Gaillard,76,,,76619000ZL0027,,,,,,,,,,,,,0,,,,,T,terres,,,68534,1.392164,49.988153
2023-987654,2023-10-28,000001,Vente,240000,,,LA PLAINE DU TOST,B042,76260,76619,Saint-Martin-le-Gaillard,76,,,76619000ZL0027,,,,,,,,,,,,,0,,,,,T,terres,,,137066,1.392164,49.988153
2023-988435,2023-10-31,000001,Vente,45000,25,,RUE L'HERMINA,0004,76260,76619,Saint-Martin-le-Gaillard,76,,,76619000AP0053,,,,,,,,,,,,,0,1,Maison,43,3,S,sols,,,271,1.371284,49.978679
