id_mutation,date_mutation,numero_disposition,nature_mutation,valeur_fonciere,adresse_numero,adresse_suffixe,adresse_nom_voie,adresse_code_voie,code_postal,code_commune,nom_commune,code_departement,ancien_code_commune,ancien_nom_commune,id_parcelle,ancien_id_parcelle,numero_volume,lot1_numero,lot1_surface_carrez,lot2_numero,lot2_surface_carrez,lot3_numero,lot3_surface_carrez,lot4_numero,lot4_surface_carrez,lot5_numero,lot5_surface_carrez,nombre_lots,code_type_local,type_local,surface_reelle_bati,nombre_pieces_principales,code_nature_culture,nature_culture,code_nature_culture_speciale,nature_culture_speciale,surface_terrain,longitude,latitude
2023-991017,2023-01-18,000001,Vente,301500,60,B,RUE DES CHOUQUETTES,0025,76560,76679,Sommesnil,76,,,766790000A0404,,,,,,,,,,,,,0,1,Maison,206,6,AG,terrains d'agrément,,,2892,0.673216,49.712212
2023-991017,2023-01-18,000001,Vente,301500,60,B,RUE DES CHOUQUETTES,0025,76560,76679,Sommesnil,76,,,766790000A0404,,,,,,,,,,,,,0,1,Maison,206,6,S,sols,,,500,0.673216,49.712212
2023-992091,2023-03-23,000001,Vente,,,,LE CHATEAU,B002,76560,76679,Sommesnil,76,,,766790000A0186,,,,,,,,,,,,,0,,,,,S,sols,,,54,0.685494,49.708455
2023-992091,2023-03-23,000001,Vente,,1110,,RUE DU MONT CARMEL,0075,76560,76679,Sommesnil,76,,,766790000A0187,,,,,,,,,,,,,0,4,Local industriel. commercial ou assimilé,,0,S,sols,,,46,0.683458,49.707544
2023-992569,2023-04-14,000001,Vente,465000,,,LA VALLEE,B006,76560,76679,Sommesnil,76,,,766790000A0067,,,,,,,,,,,,,0,,,,,P,prés,,,1920,0.676265,49.718209
2023-994710,2023-06-30,000001,Vente,85000,28,,RUE DES CHOUQUETTES,0025,76560,76679,Sommesnil,76,,,766790000A0371,,,,,,,,,,,,,0,4,Local industriel. commercial ou assimilé,180,0,P,prés,,,728,0.673056,49.711907
2023-994710,2023-06-30,000001,Vente,85000,28,,RUE DES CHOUQUETTES,0025,76560,76679,Sommesnil,76,,,766790000A0371,,,,,,,,,,,,,0,4,Local industriel. commercial ou assimilé,180,0,S,sols,,,500,0.673056,49.711907
2023-994710,2023-06-30,000001,Vente,85000,,,LE VILLAGE,B007,76560,76679,Sommesnil,76,,,766790000A0403,,,,,,,,,,,,,0,,,,,S,sols,,,24,0.672879,49.711955
