id_mutation,date_mutation,numero_disposition,nature_mutation,valeur_fonciere,adresse_numero,adresse_suffixe,adresse_nom_voie,adresse_code_voie,code_postal,code_commune,nom_commune,code_departement,ancien_code_commune,ancien_nom_commune,id_parcelle,ancien_id_parcelle,numero_volume,lot1_numero,lot1_surface_carrez,lot2_numero,lot2_surface_carrez,lot3_numero,lot3_surface_carrez,lot4_numero,lot4_surface_carrez,lot5_numero,lot5_surface_carrez,nombre_lots,code_type_local,type_local,surface_reelle_bati,nombre_pieces_principales,code_nature_culture,nature_culture,code_nature_culture_speciale,nature_culture_speciale,surface_terrain,longitude,latitude
2023-978177,2023-02-10,000001,Vente,158000,70,,RTE DE DIEPPE,0002,76590,76698,Torcy-le-Petit,76,,,766980000A0386,,,,,,,,,,,,,0,1,Maison,100,4,S,sols,,,165,1.172853,49.814844
2023-978177,2023-02-10,000001,Vente,158000,70,,RTE DE DIEPPE,0002,76590,76698,Torcy-le-Petit,76,,,766980000A0386,,,,,,,,,,,,,0,3,Dépendance,,0,S,sols,,,165,1.172853,49.814844
2023-978177,2023-02-10,000001,Vente,158000,,,LE VILLAGE,B012,76590,76698,Torcy-le-Petit,76,,,766980000A0389,,,,,,,,,,,,,0,,,,,S,sols,,,65,1.172939,49.814818
2023-978656,2023-03-02,000001,Vente,180550,57,,RTE DE DIEPPE,0002,76590,76698,Torcy-le-Petit,76,,,766980000A0361,,,,,,,,,,,,,0,1,Maison,124,3,S,sols,,,388,1.172185,49.813988
2023-978656,2023-03-02,000001,Vente,180550,,,LE VILLAGE,B012,76590,76698,Torcy-le-Petit,76,,,766980000A0362,,,,,,,,,,,,,0,,,,,J,jardins,,,152,1.171912,49.81401
2023-978854,2023-03-17,000001,Vente,157000,61,,RTE DE DIEPPE,0002,76590,76698,Torcy-le-Petit,76,,,766980000A0360,,,,,,,,,,,,,0,1,Maison,103,4,S,sols,,,210,1.172392,49.814136
2023-978854,2023-03-17,000001,Vente,157000,61,,RTE DE DIEPPE,0002,76590,76698,Torcy-le-Petit,76,,,766980000A0360,,,,,,,,,,,,,0,3,Dépendance,,0,S,sols,,,210,1.172392,49.814136
2023-980321,2023-04-22,000001,Vente,147300,36,,RTE DE DIEPPE,0002,76590,76698,Torcy-le-Petit,76,,,766980000A0788,,,,,,,,,,,,,0,1,Maison,52,1,S,sols,,,617,1.17338,49.81194
2023-980321,2023-04-22,000001,Vente,147300,,,LE VILLAGE,B012,76590,76698,Torcy-le-Petit,76,,,766980000A0791,,,,,,,,,,,,,0,,,,,S,sols,,,263,1.173488,49.811721
2023-981895,2023-06-06,000001,Vente,135000,10,,RUE DES FORRIERES,0005,76590,76698,Torcy-le-Petit,76,,,766980000A0563,,,,,,,,,,,,,0,1,Maison,70,5,S,sols,,,126,1.172592,49.810374
2023-984890,2023-08-02,000001,Vente,209000,114,,RTE DE DIEPPE,0002,76590,76698,Torcy-le-Petit,76,,,766980000A0317,,,,,,,,,,,,,0,1,Maison,140,5,P,prés,,,908,1.171535,49.820865
2023-984890,2023-08-02,000001,Vente,209000,114,,RTE DE DIEPPE,0002,76590,76698,Torcy-le-Petit,76,,,766980000A0317,,,,,,,,,,,,,0,1,Maison,140,5,S,sols,,,146,1.171535,49.820865
2023-989415,2023-12-18,000001,Vente,41000,63,,RUE DES FORRIERES,0005,76590,76698,Torcy-le-Petit,76,,,766980000A0757,,,,,,,,,,,,,0,3,Dépendance,,0,S,sols,,,500,1.170542,49.814759
2023-989415,2023-12-18,000001,Vente,41000,63,,RUE DES FORRIERES,0005,76590,76698,Torcy-le-Petit,76,,,766980000A0757,,,,,,,,,,,,,0,1,Maison,107,4,S,sols,,,500,1.170542,49.814759
2023-989415,2023-12-18,000001,Vente,41000,63,,RUE DES FORRIERES,0005,76590,76698,Torcy-le-Petit,76,,,766980000A0757,,,,,,,,,,,,,0,3,Dépendance,,0,S,sols,,,500,1.170542,49.814759
2023-989415,2023-12-18,000001,Vente,41000,1,B,RUE DE LA MALADRERIE,0014,76590,76698,Torcy-le-Petit,76,,,766980000A0760,,,,,,,,,,,,,0,,,,,S,sols,,,16,1.170342,49.814765
2023-989616,2023-12-18,000002,Vente,25000,,,LE VILLAGE,B012,76590,76698,Torcy-le-Petit,76,,,766980000A0839,,,,,,,,,,,,,0,,,,,AG,terrains d'agrément,,,426,1.172919,49.809759
2023-989616,2023-12-18,000002,Vente,25000,,,LE VILLAGE,B012,76590,76698,Torcy-le-Petit,76,,,766980000A0841,,,,,,,,,,,,,0,,,,,AG,terrains d'agrément,,,340,,
