id_mutation,date_mutation,numero_disposition,nature_mutation,valeur_fonciere,adresse_numero,adresse_suffixe,adresse_nom_voie,adresse_code_voie,code_postal,code_commune,nom_commune,code_departement,ancien_code_commune,ancien_nom_commune,id_parcelle,ancien_id_parcelle,numero_volume,lot1_numero,lot1_surface_carrez,lot2_numero,lot2_surface_carrez,lot3_numero,lot3_surface_carrez,lot4_numero,lot4_surface_carrez,lot5_numero,lot5_surface_carrez,nombre_lots,code_type_local,type_local,surface_reelle_bati,nombre_pieces_principales,code_nature_culture,nature_culture,code_nature_culture_speciale,nature_culture_speciale,surface_terrain,longitude,latitude
2023-1044108,2023-01-16,000001,Vente,81000,12,,RUE DES LAVANDIERES,0080,79420,79029,Beaulieu-sous-Parthenay,79,,,79029000AB0035,,,,,,,,,,,,,0,1,Maison,81,3,S,sols,,,658,-0.236615,46.576552
2023-1044108,2023-01-16,000001,Vente,81000,12,,RUE DES LAVANDIERES,0080,79420,79029,Beaulieu-sous-Parthenay,79,,,79029000AB0035,,,,,,,,,,,,,0,3,Dépendance,,0,S,sols,,,658,-0.236615,46.576552
2023-1044866,2023-02-17,000001,Echange,5,,,LA JAMONNIERE,B059,79420,79029,Beaulieu-sous-Parthenay,79,,,790290000A0815,,,,,,,,,,,,,0,,,,,J,jardins,,,5,-0.230914,46.589776
2023-1044867,2023-02-17,000002,Echange,1800,,,LA JAMONNIERE,B059,79420,79029,Beaulieu-sous-Parthenay,79,,,790290000A0817,,,,,,,,,,,,,0,,,,,T,terres,,,438,-0.230935,46.590177
2023-1047209,2023-05-02,000001,Vente,65000,,,LA PEIGNERIE,B079,79420,79029,Beaulieu-sous-Parthenay,79,,,790290000E0220,,,,,,,,,,,,,0,,,,,J,jardins,,,950,-0.212433,46.553722
2023-1047209,2023-05-02,000001,Vente,65000,,,LA PEIGNERIE,B079,79420,79029,Beaulieu-sous-Parthenay,79,,,790290000E0975,,,,,,,,,,,,,0,,,,,S,sols,,,2324,-0.213326,46.553462
2023-1047209,2023-05-02,000001,Vente,65000,5195,,LA PEIGNERIE,B079,79420,79029,Beaulieu-sous-Parthenay,79,,,790290000E0996,,,,,,,,,,,,,0,3,Dépendance,,0,S,sols,,,199,-0.212937,46.553664
2023-1047209,2023-05-02,000001,Vente,65000,5195,,LA PEIGNERIE,B079,79420,79029,Beaulieu-sous-Parthenay,79,,,790290000E0996,,,,,,,,,,,,,0,3,Dépendance,,0,S,sols,,,199,-0.212937,46.553664
2023-1047209,2023-05-02,000001,Vente,65000,5195,,LA PEIGNERIE,B079,79420,79029,Beaulieu-sous-Parthenay,79,,,790290000E0996,,,,,,,,,,,,,0,1,Maison,101,4,S,sols,,,199,-0.212937,46.553664
2023-1049727,2023-07-10,000001,Vente,1747500,,,BOIS BRULE,B008,79420,79029,Beaulieu-sous-Parthenay,79,,,790290000E0076,,,,,,,,,,,,,0,,,,,T,terres,,,21570,-0.227614,46.559414
2023-1049728,2023-07-10,000002,Vente,105000,,,BOIS BRULE,B008,79420,79029,Beaulieu-sous-Parthenay,79,,,790290000E0080,,,,,,,,,,,,,0,,,,,T,terres,,,11260,-0.22766,46.561645
2023-1049728,2023-07-10,000002,Vente,105000,,,LA MAISON NEUVE OUEST,B061,79420,79029,Beaulieu-sous-Parthenay,79,,,790290000E0329,,,,,,,,,,,,,0,,,,,T,terres,,,932,-0.232792,46.564555
2023-1049728,2023-07-10,000002,Vente,105000,,,LA MAISON NEUVE OUEST,B061,79420,79029,Beaulieu-sous-Parthenay,79,,,790290000E0330,,,,,,,,,,,,,0,,,,,P,prés,,,3687,-0.232945,46.564175
2023-1049728,2023-07-10,000002,Vente,105000,,,LA MAISON NEUVE OUEST,B061,79420,79029,Beaulieu-sous-Parthenay,79,,,790290000E0331,,,,,,,,,,,,,0,,,,,P,prés,,,596,-0.233516,46.56462
2023-1049728,2023-07-10,000002,Vente,105000,,,LA MAISON NEUVE OUEST,B061,79420,79029,Beaulieu-sous-Parthenay,79,,,790290000E0332,,,,,,,,,,,,,0,,,,,T,terres,,,1197,-0.232997,46.564809
2023-1049728,2023-07-10,000002,Vente,105000,,,LA MAISON NEUVE OUEST,B061,79420,79029,Beaulieu-sous-Parthenay,79,,,790290000E0333,,,,,,,,,,,,,0,,,,,T,terres,,,473,-0.233148,46.564974
2023-1049728,2023-07-10,000002,Vente,105000,,,LA MAISON NEUVE OUEST,B061,79420,79029,Beaulieu-sous-Parthenay,79,,,790290000E0334,,,,,,,,,,,,,0,,,,,S,sols,,,184,-0.232915,46.565195
2023-1049728,2023-07-10,000002,Vente,105000,,,LA MAISON NEUVE OUEST,B061,79420,79029,Beaulieu-sous-Parthenay,79,,,790290000E0624,,,,,,,,,,,,,0,,,,,S,sols,,,265,-0.232873,46.564988
2023-1050300,2023-08-03,000001,Vente,5000,,,LA PEIGNERIE,B079,79420,79029,Beaulieu-sous-Parthenay,79,,,790290000E1006,,,,,,,,,,,,,0,,,,,S,sols,,,35,-0.212807,46.553804
2023-1051809,2023-10-19,000001,Vente,179000,5291,,LA CHATAIGNERAIE,B033,79420,79029,Beaulieu-sous-Parthenay,79,,,790290000B0333,,,,,,,,,,,,,0,3,Dépendance,,0,S,sols,,,500,-0.224049,46.580381
2023-1051809,2023-10-19,000001,Vente,179000,5291,,LA CHATAIGNERAIE,B033,79420,79029,Beaulieu-sous-Parthenay,79,,,790290000B0333,,,,,,,,,,,,,0,1,Maison,128,4,J,jardins,,,1740,-0.224049,46.580381
2023-1051809,2023-10-19,000001,Vente,179000,5291,,LA CHATAIGNERAIE,B033,79420,79029,Beaulieu-sous-Parthenay,79,,,790290000B0333,,,,,,,,,,,,,0,3,Dépendance,,0,J,jardins,,,1740,-0.224049,46.580381
2023-1051809,2023-10-19,000001,Vente,179000,5291,,LA CHATAIGNERAIE,B033,79420,79029,Beaulieu-sous-Parthenay,79,,,790290000B0333,,,,,,,,,,,,,0,1,Maison,128,4,S,sols,,,500,-0.224049,46.580381
2023-1051882,2023-10-19,000001,Vente,285000,,,LES BROUSSES,B022,79420,79029,Beaulieu-sous-Parthenay,79,,,790290000A0405,,,,,,,,,,,,,0,,,,,BP,peupleraies,,,2070,-0.236885,46.594331
2023-1051882,2023-10-19,000001,Vente,285000,,,LES ROCHERIES,B091,79420,79029,Beaulieu-sous-Parthenay,79,,,790290000A0433,,,,,,,,,,,,,0,,,,,E,eaux,ETANG,Etangs,1500,-0.234788,46.59328
2023-1051882,2023-10-19,000001,Vente,285000,,,LES ROCHERIES,B091,79420,79029,Beaulieu-sous-Parthenay,79,,,790290000A0433,,,,,,,,,,,,,0,,,,,P,prés,,,4500,-0.234788,46.59328
2023-1051882,2023-10-19,000001,Vente,285000,,,LES ROCHERIES,B091,79420,79029,Beaulieu-sous-Parthenay,79,,,790290000A0433,,,,,,,,,,,,,0,,,,,E,eaux,MARE,Mare,500,-0.234788,46.59328
2023-1051882,2023-10-19,000001,Vente,285000,,,LES ROCHERIES,B091,79420,79029,Beaulieu-sous-Parthenay,79,,,790290000A0633,,,,,,,,,,,,,0,,,,,L,landes,,,12000,-0.23382,46.593026
2023-1052037,2023-10-12,000001,Vente,2000,,,MAUVERGNE,B063,79420,79029,Beaulieu-sous-Parthenay,79,,,790290000E0964,,,,,,,,,,,,,0,,,,,S,sols,,,983,-0.215682,46.564576
2023-1052037,2023-10-12,000001,Vente,2000,5203,,MAUVERGNE,B063,79420,79029,Beaulieu-sous-Parthenay,79,,,790290000E0998,,,,,,,,,,,,,0,1,Maison,98,5,S,sols,,,61,-0.215814,46.564791
2023-1052037,2023-10-12,000001,Vente,2000,5203,,MAUVERGNE,B063,79420,79029,Beaulieu-sous-Parthenay,79,,,790290000E0998,,,,,,,,,,,,,0,3,Dépendance,,0,S,sols,,,61,-0.215814,46.564791
2023-1052037,2023-10-12,000001,Vente,2000,,,MAUVERGNE,B063,79420,79029,Beaulieu-sous-Parthenay,79,,,790290000E1000,,,,,,,,,,,,,0,,,,,S,sols,,,18,-0.215782,46.564728
2023-1052171,2023-10-31,000001,Vente,131750,7,,RUE DES LAVANDIERES,0080,79420,79029,Beaulieu-sous-Parthenay,79,,,79029000AB0039,,,,,,,,,,,,,0,1,Maison,86,3,S,sols,,,588,-0.236806,46.576311
2023-1052228,2023-10-25,000001,Vente,7000,5087,,LA GUILLONNIERE,B056,79420,79029,Beaulieu-sous-Parthenay,79,,,790290000A0131,,,,,,,,,,,,,0,1,Maison,60,3,S,sols,,,185,-0.24429,46.578
2023-1052228,2023-10-25,000001,Vente,7000,,,LA GUILLONNIERE,B056,79420,79029,Beaulieu-sous-Parthenay,79,,,790290000A0147,,,,,,,,,,,,,0,,,,,J,jardins,,,294,-0.244267,46.57749
2023-1052228,2023-10-25,000001,Vente,7000,,,LA GUILLONNIERE,B056,79420,79029,Beaulieu-sous-Parthenay,79,,,790290000A0820,,,,,,,,,,,,,0,,,,,S,sols,,,160,-0.24435,46.578224
2023-1052228,2023-10-25,000001,Vente,7000,,,LA GUILLONNIERE,B056,79420,79029,Beaulieu-sous-Parthenay,79,,,790290000A0822,,,,,,,,,,,,,0,,,,,S,sols,,,50,-0.244251,46.578151
2023-1052575,2023-11-08,000001,Vente,15000,,,RUE DE LA MEILLERAYE,0095,79420,79029,Beaulieu-sous-Parthenay,79,,,79029000AC0151,,,,,,,,,,,,,0,,,,,AG,terrains d'agrément,,,783,-0.233469,46.576201
2023-1052576,2023-11-09,000001,Vente,72500,1,,IMP DU PRE DES BARRES,0120,79420,79029,Beaulieu-sous-Parthenay,79,,,79029000AB0065,,,,,,,,,,,,,0,1,Maison,76,4,S,sols,,,842,-0.236278,46.574079
2023-1054194,2023-12-19,000001,Vente,10800,15,,RUE DE CHAMPTOURNEAU,0025,79420,79029,Beaulieu-sous-Parthenay,79,,,79029000AC0130,,,,,,,,,,,,,0,,,,,AB,terrains a bâtir,,,432,-0.22978,46.574665
