id_mutation,date_mutation,numero_disposition,nature_mutation,valeur_fonciere,adresse_numero,adresse_suffixe,adresse_nom_voie,adresse_code_voie,code_postal,code_commune,nom_commune,code_departement,ancien_code_commune,ancien_nom_commune,id_parcelle,ancien_id_parcelle,numero_volume,lot1_numero,lot1_surface_carrez,lot2_numero,lot2_surface_carrez,lot3_numero,lot3_surface_carrez,lot4_numero,lot4_surface_carrez,lot5_numero,lot5_surface_carrez,nombre_lots,code_type_local,type_local,surface_reelle_bati,nombre_pieces_principales,code_nature_culture,nature_culture,code_nature_culture_speciale,nature_culture_speciale,surface_terrain,longitude,latitude
2023-1043855,2023-01-02,000001,Vente,52500,,,BOUGOUIN,B012,79370,79129,Fressines,79,,,79129000AN0433,,,,,,,,,,,,,0,,,,,S,sols,,,221,-0.308255,46.328697
2023-1043855,2023-01-02,000001,Vente,52500,54,,RUE DU CHATEAU,0067,79370,79129,Fressines,79,,,79129000AN0445,,,,,,,,,,,,,0,,,,,S,sols,,,7,-0.308199,46.328714
2023-1043855,2023-01-02,000001,Vente,52500,,,BOUGOUIN,B012,79370,79129,Fressines,79,,,79129000AN0449,,,,,,,,,,,,,0,,,,,S,sols,,,126,-0.307943,46.328558
2023-1043855,2023-01-02,000001,Vente,52500,,,BOUGOUIN,B012,79370,79129,Fressines,79,,,79129000AN0454,,,,,,,,,,,,,0,,,,,AB,terrains a bâtir,,,909,-0.307869,46.328206
2023-1043855,2023-01-02,000001,Vente,52500,,,BOUGOUIN,B012,79370,79129,Fressines,79,,,79129000AN0455,,,,,,,,,,,,,0,,,,,S,sols,,,340,-0.30793,46.32838
2023-1044513,2023-01-26,000001,Vente,130000,127,,RTE DE VAUMOREAU,0261,79370,79129,Fressines,79,,,79129000AL0040,,,,,,,,,,,,,0,1,Maison,84,5,J,jardins,,,690,-0.321087,46.322125
2023-1044513,2023-01-26,000001,Vente,130000,127,,RTE DE VAUMOREAU,0261,79370,79129,Fressines,79,,,79129000AL0040,,,,,,,,,,,,,0,1,Maison,84,5,S,sols,,,453,-0.321087,46.322125
2023-1044516,2023-01-18,000001,Vente,26300,,,CHAMPS BRIANT,B019,79370,79129,Fressines,79,,,79129000ZH0033,,,,,,,,,,,,,0,,,,,T,terres,,,36878,-0.279134,46.332982
2023-1044516,2023-01-18,000001,Vente,26300,,,L ORTET,B068,79370,79129,Fressines,79,,,79129000ZH0042,,,,,,,,,,,,,0,,,,,T,terres,,,4387,-0.277768,46.333789
2023-1044516,2023-01-18,000001,Vente,26300,,,L ORTET,B068,79370,79129,Fressines,79,,,79129000ZH0046,,,,,,,,,,,,,0,,,,,P,prés,,,16550,-0.27554,46.333407
2023-1044516,2023-01-18,000001,Vente,26300,,,L ORTET,B068,79370,79129,Fressines,79,,,79129000ZH0047,,,,,,,,,,,,,0,,,,,T,terres,,,12615,-0.275037,46.333038
2023-1044516,2023-01-18,000001,Vente,26300,,,L ORTET,B068,79370,79129,Fressines,79,,,79129000ZH0049,,,,,,,,,,,,,0,,,,,P,prés,,,7355,-0.277562,46.331997
2023-1044539,2023-01-31,000001,Vente,110000,,,PIED POUZIN,B073,79370,79129,Fressines,79,,,79129000AD0055,,,,,,,,,,,,,0,,,,,P,prés,,,5195,-0.293343,46.326647
2023-1044539,2023-01-31,000001,Vente,110000,,,PIED POUZIN,B073,79370,79129,Fressines,79,,,79129000AD0055,,,,,,,,,,,,,0,,,,,S,sols,,,650,-0.293343,46.326647
2023-1044539,2023-01-31,000001,Vente,110000,5439,,PIED POUZIN,B073,79370,79129,Fressines,79,,,79129000AD0056,,,,,,,,,,,,,0,3,Dépendance,,0,S,sols,,,92,-0.294044,46.326452
2023-1044539,2023-01-31,000001,Vente,110000,5439,,PIED POUZIN,B073,79370,79129,Fressines,79,,,79129000AD0056,,,,,,,,,,,,,0,3,Dépendance,,0,S,sols,,,92,-0.294044,46.326452
2023-1044539,2023-01-31,000001,Vente,110000,,,MAYOLLE,B061,79370,79129,Fressines,79,,,79129000AD0066,,,,,,,,,,,,,0,,,,,P,prés,,,1391,-0.292044,46.327264
2023-1044539,2023-01-31,000001,Vente,110000,,,MAYOLLE,B061,79370,79129,Fressines,79,,,79129000AD0068,,,,,,,,,,,,,0,,,,,P,prés,,,14943,-0.288728,46.327282
2023-1044539,2023-01-31,000001,Vente,110000,,,MAYOLLE,B061,79370,79129,Fressines,79,,,79129000AD0068,,,,,,,,,,,,,0,,,,,P,prés,,,14942,-0.288728,46.327282
2023-1044539,2023-01-31,000001,Vente,110000,,,MAYOLLE,B061,79370,79129,Fressines,79,,,79129000AD0098,,,,,,,,,,,,,0,,,,,P,prés,,,13220,-0.285621,46.327754
2023-1044539,2023-01-31,000001,Vente,110000,,,PIED POUZIN,B073,79370,79129,Fressines,79,,,79129000AD0415,,,,,,,,,,,,,0,,,,,S,sols,,,781,-0.294315,46.326701
2023-1044539,2023-01-31,000001,Vente,110000,,,PIED POUZIN,B073,79370,79129,Fressines,79,,,79129000AD0415,,,,,,,,,,,,,0,,,,,P,prés,,,874,-0.294315,46.326701
2023-1044539,2023-01-31,000001,Vente,110000,7,,CHE DE PIED POUZIN,0182,79370,79129,Fressines,79,,,79129000AD0419,,,,,,,,,,,,,0,3,Dépendance,,0,S,sols,,,276,-0.294809,46.326657
2023-1044539,2023-01-31,000001,Vente,110000,7,,CHE DE PIED POUZIN,0182,79370,79129,Fressines,79,,,79129000AD0419,,,,,,,,,,,,,0,3,Dépendance,,0,S,sols,,,276,-0.294809,46.326657
2023-1044539,2023-01-31,000001,Vente,110000,7,,CHE DE PIED POUZIN,0182,79370,79129,Fressines,79,,,79129000AD0419,,,,,,,,,,,,,0,1,Maison,168,6,S,sols,,,276,-0.294809,46.326657
2023-1044782,2023-01-20,000001,Vente,113000,,,LA BILLAUDIERE,B009,79370,79129,Fressines,79,,,79129000AI0003,,,,,,,,,,,,,0,,,,,S,sols,,,33,-0.30935,46.321579
2023-1044782,2023-01-20,000001,Vente,113000,,,LA BILLAUDIERE,B009,79370,79129,Fressines,79,,,79129000AI0004,,,,,,,,,,,,,0,,,,,S,sols,,,67,-0.309232,46.321666
2023-1044782,2023-01-20,000001,Vente,113000,,,LA BILLAUDIERE,B009,79370,79129,Fressines,79,,,79129000AI0005,,,,,,,,,,,,,0,,,,,J,jardins,,,285,-0.30931,46.32165
2023-1044782,2023-01-20,000001,Vente,113000,48,,RUE DE LA BILLAUDIERE,0021,79370,79129,Fressines,79,,,79129000AI0017,,,,,,,,,,,,,0,3,Dépendance,,0,S,sols,,,83,-0.307857,46.32191
2023-1044782,2023-01-20,000001,Vente,113000,48,,RUE DE LA BILLAUDIERE,0021,79370,79129,Fressines,79,,,79129000AI0017,,,,,,,,,,,,,0,1,Maison,90,4,S,sols,,,83,-0.307857,46.32191
2023-1045086,2023-02-15,000001,Vente,1149,,,CHAMPS BOUREAU,B017,79370,79129,Fressines,79,,,79129000AN0243,,,,,,,,,,,,,0,,,,,P,prés,,,1845,-0.301224,46.324423
2023-1045086,2023-02-15,000001,Vente,1149,,,FOND RIOUX,B045,79370,79129,Fressines,79,,,79129000AN0246,,,,,,,,,,,,,0,,,,,P,prés,,,3900,-0.302626,46.324423
2023-1045087,2023-02-15,000001,Vente,184.2,,,FOND RIOUX,B045,79370,79129,Fressines,79,,,79129000AN0245,,,,,,,,,,,,,0,,,,,BT,taillis simples,,,600,-0.302358,46.324636
2023-1045087,2023-02-15,000001,Vente,184.2,,,SALPOT NORD,B095,79370,79129,Fressines,79,,,79129000AN0458,,,,,,,,,,,,,0,,,,,P,prés,,,321,-0.302754,46.324781
2023-1045088,2023-02-15,000001,Vente,78,,,SALPOT NORD,B095,79370,79129,Fressines,79,,,79129000AN0461,,,,,,,,,,,,,0,,,,,L,landes,,,390,-0.303273,46.325197
2023-1045239,2023-02-20,000001,Vente,1470,,,LE VARADIER,B108,79370,79129,Fressines,79,,,79129000AI0296,,,,,,,,,,,,,0,,,,,S,sols,,,35,-0.302244,46.319618
2023-1045240,2023-02-20,000002,Vente,74030,,,LE VARADIER,B108,79370,79129,Fressines,79,,,79129000AI0297,,,,,,,,,,,,,0,,,,,J,jardins,,,1163,-0.302416,46.319809
2023-1045240,2023-02-20,000002,Vente,74030,67,,RUE DES SOUTERRAINS,0249,79370,79129,Fressines,79,,,79129000AI0324,,,,,,,,,,,,,0,3,Dépendance,,0,S,sols,,,619,-0.302998,46.320206
2023-1045240,2023-02-20,000002,Vente,74030,67,,RUE DES SOUTERRAINS,0249,79370,79129,Fressines,79,,,79129000AI0324,,,,,,,,,,,,,0,3,Dépendance,,0,S,sols,,,619,-0.302998,46.320206
2023-1045352,2023-02-21,000001,Vente,26300,,,SUR LES FOSSES,B047,79370,79129,Fressines,79,,,79129000ZE0020,,,,,,,,,,,,,0,,,,,T,terres,,,7867,-0.282821,46.340879
2023-1045352,2023-02-21,000001,Vente,26300,,,SUR LES FOSSES,B047,79370,79129,Fressines,79,,,79129000ZE0020,,,,,,,,,,,,,0,,,,,T,terres,,,15734,-0.282821,46.340879
2023-1045372,2023-03-06,000001,Vente,225100,57,,RUE DU HAUT MOULAY,0107,79370,79129,Fressines,79,,,79129000ZD0090,,,,,,,,,,,,,0,1,Maison,132,5,J,jardins,,,600,-0.292768,46.337179
2023-1045372,2023-03-06,000001,Vente,225100,57,,RUE DU HAUT MOULAY,0107,79370,79129,Fressines,79,,,79129000ZD0090,,,,,,,,,,,,,0,1,Maison,132,5,S,sols,,,674,-0.292768,46.337179
2023-1046504,2023-04-17,000001,Vente,625500,20,,ALL DES PLATANES,0190,79370,79129,Fressines,79,,,79129000AI0078,,,,,,,,,,,,,0,3,Dépendance,,0,S,sols,,,3122,-0.305714,46.321901
2023-1046504,2023-04-17,000001,Vente,625500,20,,ALL DES PLATANES,0190,79370,79129,Fressines,79,,,79129000AI0078,,,,,,,,,,,,,0,3,Dépendance,,0,S,sols,,,3122,-0.305714,46.321901
2023-1046504,2023-04-17,000001,Vente,625500,20,,ALL DES PLATANES,0190,79370,79129,Fressines,79,,,79129000AI0078,,,,,,,,,,,,,0,3,Dépendance,,0,S,sols,,,3122,-0.305714,46.321901
2023-1046504,2023-04-17,000001,Vente,625500,20,,ALL DES PLATANES,0190,79370,79129,Fressines,79,,,79129000AI0078,,,,,,,,,,,,,0,1,Maison,240,8,S,sols,,,3122,-0.305714,46.321901
2023-1046504,2023-04-17,000001,Vente,625500,,,LA BILLAUDIERE,B009,79370,79129,Fressines,79,,,79129000AI0083,,,,,,,,,,,,,0,,,,,AG,terrains d'agrément,,,3494,-0.305352,46.321416
2023-1046504,2023-04-17,000001,Vente,625500,,,LA BILLAUDIERE,B009,79370,79129,Fressines,79,,,79129000AI0427,,,,,,,,,,,,,0,,,,,T,terres,,,1672,-0.305107,46.321767
2023-1046504,2023-04-17,000001,Vente,625500,,,LA BILLAUDIERE,B009,79370,79129,Fressines,79,,,79129000AI0497,,,,,,,,,,,,,0,,,,,T,terres,,,1793,-0.305679,46.321125
2023-1046834,2023-04-07,000001,Vente,311950,11,,RTE DE BOIS MARTIN,0027,79370,79129,Fressines,79,,,79129000ZE0208,,,,,,,,,,,,,0,1,Maison,128,5,S,sols,,,1280,-0.288069,46.334271
2023-1046968,2023-04-12,000001,Vente,124460,,,LA BILLAUDIERE,B009,79370,79129,Fressines,79,,,79129000AI0498,,,,,,,,,,,,,0,,,,,T,terres,,,12446,-0.305759,46.320178
2023-1046986,2023-04-17,000001,Vente,333000,,,CHAMPS BELLIER,B016,79370,79129,Fressines,79,,,79129000ZL0156,,,,,,,,,,,,,0,,,,,S,sols,,,294,-0.306478,46.318974
2023-1046986,2023-04-17,000001,Vente,333000,6,B,RUE DES VIGNES,0269,79370,79129,Fressines,79,,,79129000ZL0168,,,,,,,,,,,,,0,1,Maison,143,5,S,sols,,,813,-0.306795,46.319134
2023-1046986,2023-04-17,000001,Vente,333000,,,CHAMPS BELLIER,B016,79370,79129,Fressines,79,,,79129000ZL0169,,,,,,,,,,,,,0,,,,,S,sols,,,169,-0.306791,46.319047
2023-1047429,2023-04-28,000001,Vente,245000,,,LES COMBES,B039,79370,79129,Fressines,79,,,79129000ZD0093,,,,,,,,,,,,,0,,,,,S,sols,,,142,-0.292475,46.337561
2023-1047429,2023-04-28,000001,Vente,245000,65,,RUE DU HAUT MOULAY,0107,79370,79129,Fressines,79,,,79129000ZD0095,,,,,,,,,,,,,0,3,Dépendance,,0,J,jardins,,,776,-0.292909,46.337826
2023-1047429,2023-04-28,000001,Vente,245000,65,,RUE DU HAUT MOULAY,0107,79370,79129,Fressines,79,,,79129000ZD0095,,,,,,,,,,,,,0,3,Dépendance,,0,S,sols,,,500,-0.292909,46.337826
2023-1047429,2023-04-28,000001,Vente,245000,65,,RUE DU HAUT MOULAY,0107,79370,79129,Fressines,79,,,79129000ZD0095,,,,,,,,,,,,,0,3,Dépendance,,0,J,jardins,,,776,-0.292909,46.337826
2023-1047429,2023-04-28,000001,Vente,245000,65,,RUE DU HAUT MOULAY,0107,79370,79129,Fressines,79,,,79129000ZD0095,,,,,,,,,,,,,0,3,Dépendance,,0,S,sols,,,500,-0.292909,46.337826
2023-1047429,2023-04-28,000001,Vente,245000,65,,RUE DU HAUT MOULAY,0107,79370,79129,Fressines,79,,,79129000ZD0095,,,,,,,,,,,,,0,1,Maison,131,5,S,sols,,,500,-0.292909,46.337826
2023-1047429,2023-04-28,000001,Vente,245000,65,,RUE DU HAUT MOULAY,0107,79370,79129,Fressines,79,,,79129000ZD0095,,,,,,,,,,,,,0,3,Dépendance,,0,S,sols,,,500,-0.292909,46.337826
2023-1047429,2023-04-28,000001,Vente,245000,65,,RUE DU HAUT MOULAY,0107,79370,79129,Fressines,79,,,79129000ZD0095,,,,,,,,,,,,,0,1,Maison,131,5,J,jardins,,,776,-0.292909,46.337826
2023-1047429,2023-04-28,000001,Vente,245000,65,,RUE DU HAUT MOULAY,0107,79370,79129,Fressines,79,,,79129000ZD0095,,,,,,,,,,,,,0,3,Dépendance,,0,J,jardins,,,776,-0.292909,46.337826
2023-1047429,2023-04-28,000001,Vente,245000,,,LES COMBES,B039,79370,79129,Fressines,79,,,79129000ZD0096,,,,,,,,,,,,,0,,,,,S,sols,,,160,-0.293127,46.337744
2023-1047912,2023-06-02,000001,Vente,185000,22,,RTE DE VAUMOREAU,0261,79370,79129,Fressines,79,,,79129000AI0341,,,,,,,,,,,,,0,1,Maison,93,6,J,jardins,,,772,-0.307178,46.320337
2023-1047912,2023-06-02,000001,Vente,185000,22,,RTE DE VAUMOREAU,0261,79370,79129,Fressines,79,,,79129000AI0341,,,,,,,,,,,,,0,1,Maison,93,6,S,sols,,,775,-0.307178,46.320337
2023-1047965,2023-05-26,000001,Vente,58000,,,HAUT MOULAY,B054,79370,79129,Fressines,79,,,79129000AB0350,,,,,,,,,,,,,0,,,,,S,sols,,,296,-0.29314,46.336868
2023-1047965,2023-05-26,000001,Vente,58000,,,HAUT MOULAY,B054,79370,79129,Fressines,79,,,79129000AB0351,,,,,,,,,,,,,0,,,,,J,jardins,,,262,-0.293505,46.336729
2023-1047965,2023-05-26,000001,Vente,58000,,,HAUT MOULAY,B054,79370,79129,Fressines,79,,,79129000AB0356,,,,,,,,,,,,,0,,,,,AB,terrains a bâtir,,,772,-0.293216,46.336684
2023-1047965,2023-05-26,000001,Vente,58000,,,HAUT MOULAY,B054,79370,79129,Fressines,79,,,79129000AB0357,,,,,,,,,,,,,0,,,,,J,jardins,,,41,-0.293297,46.336555
2023-1047965,2023-05-26,000001,Vente,58000,,,HAUT MOULAY,B054,79370,79129,Fressines,79,,,79129000AB0359,,,,,,,,,,,,,0,,,,,AB,terrains a bâtir,,,329,-0.293655,46.336573
2023-1048363,2023-06-01,000001,Vente,66666,8,,RTE DE CHANTELOUP,0051,79370,79129,Fressines,79,,,79129000AH0270,,,,,,,,,,,,,0,1,Maison,116,4,S,sols,,,1167,-0.291629,46.322003
2023-1049724,2023-07-21,000001,Vente,82902,5,,IMP DU LISON,0114,79370,79129,Fressines,79,,,79129000AI0473,,,,,,,,,,,,,0,1,Maison,65,3,S,sols,,,814,-0.301405,46.321685
2023-1049818,2023-07-12,000001,Vente,214000,29,,RUE DU LAVOIR,0111,79370,79129,Fressines,79,,,79129000AI0456,,,,,,,,,,,,,0,1,Maison,108,4,S,sols,,,1042,-0.301724,46.317953
2023-1049824,2023-07-19,000001,Vente,216000,19,,RUE DES MAISONS NEUVES,0123,79370,79129,Fressines,79,,,79129000AL0011,,,,,,,,,,,,,0,1,Maison,100,3,S,sols,,,2085,-0.323986,46.321011
2023-1049824,2023-07-19,000001,Vente,216000,19,,RUE DES MAISONS NEUVES,0123,79370,79129,Fressines,79,,,79129000AL0011,,,,,,,,,,,,,0,1,Maison,100,3,AG,terrains d'agrément,,,2005,-0.323986,46.321011
2023-1049824,2023-07-19,000001,Vente,216000,19,,RUE DES MAISONS NEUVES,0123,79370,79129,Fressines,79,,,79129000AL0011,,,,,,,,,,,,,0,3,Dépendance,,0,AG,terrains d'agrément,,,2005,-0.323986,46.321011
2023-1049824,2023-07-19,000001,Vente,216000,19,,RUE DES MAISONS NEUVES,0123,79370,79129,Fressines,79,,,79129000AL0011,,,,,,,,,,,,,0,3,Dépendance,,0,S,sols,,,2085,-0.323986,46.321011
2023-1050072,2023-07-27,000001,Vente,75000,5,,RUE DU HAUT MOULAY,0107,79370,79129,Fressines,79,,,79129000AB0320,,,,,,,,,,,,,0,3,Dépendance,,0,S,sols,,,3158,-0.293556,46.332165
2023-1050072,2023-07-27,000001,Vente,75000,5,,RUE DU HAUT MOULAY,0107,79370,79129,Fressines,79,,,79129000AB0320,,,,,,,,,,,,,0,1,Maison,110,2,S,sols,,,3158,-0.293556,46.332165
2023-1050800,2023-09-06,000001,Vente,50000,,,LES COMBES,B039,79370,79129,Fressines,79,,,79129000ZD0203,,,,,,,,,,,,,0,,,,,AB,terrains a bâtir,,,877,-0.293483,46.338473
2023-1051581,2023-09-26,000001,Vente,500,,,CHAMP FRADIN,B015,79370,79129,Fressines,79,,,79129000ZK0068,,,,,,,,,,,,,0,,,,,J,jardins,,,348,-0.300337,46.31813
2023-1051784,2023-09-27,000001,Vente,160700,,,PEMANT,B071,79370,79129,Fressines,79,,,79129000AD0261,,,,,,,,,,,,,0,,,,,BT,taillis simples,,,1000,-0.291605,46.325068
2023-1051784,2023-09-27,000001,Vente,160700,,,CHAMPS VENT,B026,79370,79129,Fressines,79,,,79129000ZK0014,,,,,,,,,,,,,0,,,,,T,terres,,,23073,-0.288641,46.316992
2023-1051784,2023-09-27,000001,Vente,160700,,,CHAMPS VENT,B026,79370,79129,Fressines,79,,,79129000ZK0014,,,,,,,,,,,,,0,,,,,T,terres,,,11536,-0.288641,46.316992
2023-1051784,2023-09-27,000001,Vente,160700,,,LES MINEES,B062,79370,79129,Fressines,79,,,79129000ZK0034,,,,,,,,,,,,,0,,,,,T,terres,,,35649,-0.294208,46.316014
2023-1051784,2023-09-27,000001,Vente,160700,,,LES MINEES,B062,79370,79129,Fressines,79,,,79129000ZK0034,,,,,,,,,,,,,0,,,,,T,terres,,,35650,-0.294208,46.316014
2023-1051795,2023-10-02,000001,Vente,2000,,,BOIS DE MOULAY,B010,79370,79129,Fressines,79,,,79129000AB0139,,,,,,,,,,,,,0,,,,,T,terres,,,9236,-0.295107,46.334296
2023-1051918,2023-10-05,000001,Vente,226000,3,,RUE DES ROMPIS,0243,79370,79129,Fressines,79,,,79129000ZE0165,,,,,,,,,,,,,0,1,Maison,128,4,S,sols,,,1237,-0.274192,46.338433
2023-1052027,2023-10-16,000001,Vente,27900,,,LA BILLAUDIERE,B009,79370,79129,Fressines,79,,,79129000AI0437,,,,,,,,,,,,,0,,,,,AB,terrains a bâtir,,,466,-0.304295,46.322321
2023-1052893,2023-11-24,000001,Vente,81100,1,,IMP DU LISON,0114,79370,79129,Fressines,79,,,79129000AI0471,,,,,,,,,,,,,0,1,Maison,65,3,S,sols,,,844,-0.301223,46.322161
2023-1052919,2023-11-24,000001,Vente,82984,17,,IMP DU LISON,0114,79370,79129,Fressines,79,,,79129000AI0479,,,,,,,,,,,,,0,1,Maison,65,3,S,sols,,,896,-0.300562,46.322076
2023-1053271,2023-11-30,000001,Vente,43000,,,LE BOURG,B013,79370,79129,Fressines,79,,,79129000AI0496,,,,,,,,,,,,,0,,,,,AB,terrains a bâtir,,,599,-0.298504,46.321517
2023-1053274,2023-12-07,000001,Vente,200000,,,LA GALINIERE,B049,79370,79129,Fressines,79,,,79129000AH0190,,,,,,,,,,,,,0,,,,,S,sols,,,29,-0.297012,46.319789
2023-1053274,2023-12-07,000001,Vente,200000,,,LA GALINIERE,B049,79370,79129,Fressines,79,,,79129000AH0191,,,,,,,,,,,,,0,,,,,T,terres,,,845,-0.296997,46.319645
2023-1053274,2023-12-07,000001,Vente,200000,,,LA GALINIERE,B049,79370,79129,Fressines,79,,,79129000AH0193,,,,,,,,,,,,,0,,,,,AG,terrains d'agrément,,,1472,-0.296665,46.319511
2023-1053274,2023-12-07,000001,Vente,200000,,,LA GALINIERE,B049,79370,79129,Fressines,79,,,79129000AH0392,,,,,,,,,,,,,0,,,,,S,sols,,,491,-0.296138,46.319739
2023-1053274,2023-12-07,000001,Vente,200000,32,,RUE DE LA GALINIERE,0091,79370,79129,Fressines,79,,,79129000AH0394,,,,,,,,,,,,,0,1,Maison,180,6,S,sols,,,2071,-0.296407,46.319827
2023-1053274,2023-12-07,000001,Vente,200000,32,,RUE DE LA GALINIERE,0091,79370,79129,Fressines,79,,,79129000AH0394,,,,,,,,,,,,,0,3,Dépendance,,0,S,sols,,,2071,-0.296407,46.319827
2023-1053358,2023-12-14,000001,Vente,2500,,,LES RUELLES,B094,79370,79129,Fressines,79,,,79129000ZD0176,,,,,,,,,,,,,0,,,,,T,terres,,,10209,-0.296598,46.340222
