id_mutation,date_mutation,numero_disposition,nature_mutation,valeur_fonciere,adresse_numero,adresse_suffixe,adresse_nom_voie,adresse_code_voie,code_postal,code_commune,nom_commune,code_departement,ancien_code_commune,ancien_nom_commune,id_parcelle,ancien_id_parcelle,numero_volume,lot1_numero,lot1_surface_carrez,lot2_numero,lot2_surface_carrez,lot3_numero,lot3_surface_carrez,lot4_numero,lot4_surface_carrez,lot5_numero,lot5_surface_carrez,nombre_lots,code_type_local,type_local,surface_reelle_bati,nombre_pieces_principales,code_nature_culture,nature_culture,code_nature_culture_speciale,nature_culture_speciale,surface_terrain,longitude,latitude
2023-1044269,2023-01-23,000001,Vente,42500,2,,IMP DE LA MARTINIERE,0070,79120,79336,Vançais,79,,,79336000AC0033,,,,,,,,,,,,,0,1,Maison,105,4,S,sols,,,555,0.053376,46.302407
2023-1044269,2023-01-23,000001,Vente,42500,,,LE BOURG,B013,79120,79336,Vançais,79,,,79336000AC0034,,,,,,,,,,,,,0,,,,,S,sols,,,540,0.053234,46.302249
2023-1044691,2023-02-14,000001,Vente,323000,,,LE BOURG,B013,79120,79336,Vançais,79,,,79336000AC0092,,,,,,,,,,,,,0,,,,,T,terres,,,672,0.055075,46.30073
2023-1044691,2023-02-14,000001,Vente,323000,1,,RUE DES PATUREAUX,0093,79120,79336,Vançais,79,,,79336000AC0225,,,,,,,,,,,,,0,3,Dépendance,,0,S,sols,,,2374,0.054794,46.300276
2023-1044691,2023-02-14,000001,Vente,323000,1,,RUE DES PATUREAUX,0093,79120,79336,Vançais,79,,,79336000AC0225,,,,,,,,,,,,,0,3,Dépendance,,0,S,sols,,,2374,0.054794,46.300276
2023-1044691,2023-02-14,000001,Vente,323000,1,,RUE DES PATUREAUX,0093,79120,79336,Vançais,79,,,79336000AC0225,,,,,,,,,,,,,0,3,Dépendance,,0,S,sols,,,2374,0.054794,46.300276
2023-1044691,2023-02-14,000001,Vente,323000,1,,RUE DES PATUREAUX,0093,79120,79336,Vançais,79,,,79336000AC0225,,,,,,,,,,,,,0,1,Maison,192,5,S,sols,,,2374,0.054794,46.300276
2023-1044691,2023-02-14,000001,Vente,323000,1,,RUE DES PATUREAUX,0093,79120,79336,Vançais,79,,,79336000AC0225,,,,,,,,,,,,,0,1,Maison,61,3,S,sols,,,2374,0.054794,46.300276
2023-1044691,2023-02-14,000001,Vente,323000,1,,RUE DES PATUREAUX,0093,79120,79336,Vançais,79,,,79336000AC0225,,,,,,,,,,,,,0,3,Dépendance,,0,S,sols,,,2374,0.054794,46.300276
2023-1044691,2023-02-14,000001,Vente,323000,4,,PL DES PLATANES,0102,79120,79336,Vançais,79,,,79336000AC0251,,,,,,,,,,,,,0,,,,,S,sols,,,99,0.05479,46.300638
2023-1044691,2023-02-14,000001,Vente,323000,,,LE BOURG,B013,79120,79336,Vançais,79,,,79336000AC0253,,,,,,,,,,,,,0,,,,,S,sols,,,1006,0.054602,46.300411
2023-1045309,2023-03-03,000001,Vente,60000,3,,RUE DES PATUREAUX,0093,79120,79336,Vançais,79,,,79336000AC0094,,,,,,,,,,,,,0,1,Maison,50,2,S,sols,,,775,0.055236,46.300373
2023-1045874,2023-03-06,000001,Vente,240000,10,,RUE DES ECOLES COURGE,0029,79120,79336,Vançais,79,,,79336000AB0242,,,,,,,,,,,,,0,3,Dépendance,,0,AG,terrains d'agrément,,,2395,0.023232,46.326376
2023-1045874,2023-03-06,000001,Vente,240000,10,,RUE DES ECOLES COURGE,0029,79120,79336,Vançais,79,,,79336000AB0242,,,,,,,,,,,,,0,1,Maison,192,6,S,sols,,,2000,0.023232,46.326376
2023-1045874,2023-03-06,000001,Vente,240000,10,,RUE DES ECOLES COURGE,0029,79120,79336,Vançais,79,,,79336000AB0242,,,,,,,,,,,,,0,3,Dépendance,,0,S,sols,,,2000,0.023232,46.326376
2023-1045874,2023-03-06,000001,Vente,240000,10,,RUE DES ECOLES COURGE,0029,79120,79336,Vançais,79,,,79336000AB0242,,,,,,,,,,,,,0,1,Maison,192,6,AG,terrains d'agrément,,,2395,0.023232,46.326376
2023-1045909,2023-03-15,000001,Vente,,,,PLAINE DES GRANDES OUCHES,B172,79120,79336,Vançais,79,,,79336000ZH0110,,,,,,,,,,,,,0,,,,,P,prés,,,2576,0.058151,46.303544
2023-1045909,2023-03-15,000001,Vente,,,,PLAINE DES GRANDES OUCHES,B172,79120,79336,Vançais,79,,,79336000ZH0111,,,,,,,,,,,,,0,,,,,P,prés,,,18156,0.057791,46.302873
2023-1045909,2023-03-15,000001,Vente,,,,PLAINE DES GRANDES OUCHES,B172,79120,79336,Vançais,79,,,79336000ZH0111,,,,,,,,,,,,,0,,,,,S,sols,,,11029,0.057791,46.302873
2023-1045910,2023-03-15,000002,Vente,9000,,,PLAINE DES GRANDES OUCHES,B172,79120,79336,Vançais,79,,,79336000ZH0110,,,,,,,,,,,,,0,,,,,P,prés,,,2576,0.058151,46.303544
2023-1045910,2023-03-15,000002,Vente,9000,,,PLAINE DES GRANDES OUCHES,B172,79120,79336,Vançais,79,,,79336000ZH0111,,,,,,,,,,,,,0,,,,,S,sols,,,11029,0.057791,46.302873
2023-1045910,2023-03-15,000002,Vente,9000,,,PLAINE DES GRANDES OUCHES,B172,79120,79336,Vançais,79,,,79336000ZH0111,,,,,,,,,,,,,0,,,,,P,prés,,,18156,0.057791,46.302873
2023-1047535,2023-05-26,000001,Vente,260000,,,BOIS LE BON,B228,79120,79336,Vançais,79,,,79336000ZH0011,,,,,,,,,,,,,0,,,,,T,terres,,,1330,0.068149,46.309809
2023-1047535,2023-05-26,000001,Vente,260000,,,BOIS LE BON,B228,79120,79336,Vançais,79,,,79336000ZH0011,,,,,,,,,,,,,0,,,,,S,sols,,,1500,0.068149,46.309809
2023-1047535,2023-05-26,000001,Vente,260000,3,,IMP DE LA VENELLE,0164,79120,79336,Vançais,79,,,79336000ZH0015,,,,,,,,,,,,,0,3,Dépendance,,0,S,sols,,,790,0.068594,46.310244
2023-1047535,2023-05-26,000001,Vente,260000,3,,IMP DE LA VENELLE,0164,79120,79336,Vançais,79,,,79336000ZH0015,,,,,,,,,,,,,0,3,Dépendance,,0,S,sols,,,790,0.068594,46.310244
2023-1047535,2023-05-26,000001,Vente,260000,3,,IMP DE LA VENELLE,0164,79120,79336,Vançais,79,,,79336000ZH0015,,,,,,,,,,,,,0,1,Maison,205,7,S,sols,,,790,0.068594,46.310244
2023-1047535,2023-05-26,000001,Vente,260000,3,,IMP DE LA VENELLE,0164,79120,79336,Vançais,79,,,79336000ZH0015,,,,,,,,,,,,,0,3,Dépendance,,0,S,sols,,,790,0.068594,46.310244
2023-1047535,2023-05-26,000001,Vente,260000,,,BOIS LE BON,B228,79120,79336,Vançais,79,,,79336000ZH0016,,,,,,,,,,,,,0,,,,,S,sols,,,16,0.068418,46.310306
2023-1048707,2023-06-22,000001,Vente,60000,5117,,LE CLOUZEAU,B131,79120,79336,Vançais,79,,,79336000ZO0014,,,,,,,,,,,,,0,1,Maison,132,2,S,sols,,,3800,0.04631,46.2925
2023-1048707,2023-06-22,000001,Vente,60000,5117,,LE CLOUZEAU,B131,79120,79336,Vançais,79,,,79336000ZO0014,,,,,,,,,,,,,0,3,Dépendance,,0,S,sols,,,3800,0.04631,46.2925
2023-1048707,2023-06-22,000001,Vente,60000,,,LE CLOUZEAU,B131,79120,79336,Vançais,79,,,79336000ZO0016,,,,,,,,,,,,,0,,,,,J,jardins,,,5260,0.04596,46.292693
2023-1049422,2023-07-11,000001,Vente,44083.34,,,METAIRIE DE LAVAULT,B124,79120,79336,Vançais,79,,,79336000ZH0056,,,,,,,,,,,,,0,,,,,S,sols,,,70,0.063394,46.3066
2023-1049422,2023-07-11,000001,Vente,44083.34,,,METAIRIE DE LAVAULT,B124,79120,79336,Vançais,79,,,79336000ZH0057,,,,,,,,,,,,,0,,,,,J,jardins,,,1312,0.063716,46.306525
2023-1049422,2023-07-11,000001,Vente,44083.34,,,SOUS LAVAULT,B242,79120,79336,Vançais,79,,,79336000ZH0061,,,,,,,,,,,,,0,,,,,L,landes,,,3170,0.062548,46.306442
2023-1049422,2023-07-11,000001,Vente,44083.34,,,SOUS LAVAULT,B242,79120,79336,Vançais,79,,,79336000ZH0061,,,,,,,,,,,,,0,,,,,BS,taillis sous futaie,,,6700,0.062548,46.306442
2023-1049422,2023-07-11,000001,Vente,44083.34,5171,,METAIRIE DE LAVAULT,B124,79120,79336,Vançais,79,,,79336000ZH0087,,,,,,,,,,,,,0,1,Maison,90,4,S,sols,,,2325,0.064624,46.30666
2023-1049422,2023-07-11,000001,Vente,44083.34,,,METAIRIE DE LAVAULT,B124,79120,79336,Vançais,79,,,79336000ZH0088,,,,,,,,,,,,,0,,,,,S,sols,,,1784,0.064829,46.30696
2023-1049422,2023-07-11,000001,Vente,44083.34,,,METAIRIE DE LAVAULT,B124,79120,79336,Vançais,79,,,79336000ZH0088,,,,,,,,,,,,,0,,,,,T,terres,,,2046,0.064829,46.30696
2023-1050022,2023-08-08,000001,Vente,55000,,,LE BOURG,B013,79120,79336,Vançais,79,,,79336000AC0032,,,,,,,,,,,,,0,,,,,S,sols,,,155,0.053054,46.302624
2023-1050022,2023-08-08,000001,Vente,55000,,,LE BOURG,B013,79120,79336,Vançais,79,,,79336000AC0065,,,,,,,,,,,,,0,,,,,J,jardins,,,286,0.054599,46.302808
2023-1050022,2023-08-08,000001,Vente,55000,,,LE BOURG,B013,79120,79336,Vançais,79,,,79336000AC0070,,,,,,,,,,,,,0,,,,,J,jardins,,,155,0.054976,46.302824
2023-1050022,2023-08-08,000001,Vente,55000,,,LE BOURG,B013,79120,79336,Vançais,79,,,79336000AC0071,,,,,,,,,,,,,0,,,,,J,jardins,,,98,0.054793,46.30275
2023-1050022,2023-08-08,000001,Vente,55000,,,LE BOURG,B013,79120,79336,Vançais,79,,,79336000AC0072,,,,,,,,,,,,,0,,,,,J,jardins,,,620,0.05479,46.302731
2023-1050022,2023-08-08,000001,Vente,55000,9,,RUE MARIE ROBIN,0065,79120,79336,Vançais,79,,,79336000AC0197,,,,,,,,,,,,,0,1,Maison,140,6,S,sols,,,844,0.053329,46.302758
2023-1051778,2023-09-27,000001,Vente,199000,5088,,LE COURTIOU,B238,79120,79336,Vançais,79,,,79336000AB0151,,,,,,,,,,,,,0,3,Dépendance,,0,S,sols,,,4570,0.021955,46.324705
2023-1051778,2023-09-27,000001,Vente,199000,5088,,LE COURTIOU,B238,79120,79336,Vançais,79,,,79336000AB0151,,,,,,,,,,,,,0,1,Maison,186,4,S,sols,,,4570,0.021955,46.324705
2023-1052266,2023-10-30,000001,Vente,54088,,,LES VALLEES,B217,79120,79336,Vançais,79,,,79336000ZL0057,,,,,,,,,,,,,0,,,,,T,terres,,,25805,0.06128,46.289151
2023-1052266,2023-10-30,000001,Vente,54088,,,LES VALLEES,B217,79120,79336,Vançais,79,,,79336000ZL0057,,,,,,,,,,,,,0,,,,,T,terres,,,25806,0.06128,46.289151
2023-1052266,2023-10-30,000001,Vente,54088,,,LES VALLEES,B217,79120,79336,Vançais,79,,,79336000ZL0057,,,,,,,,,,,,,0,,,,,T,terres,,,25806,0.06128,46.289151
2023-1052266,2023-10-30,000001,Vente,54088,,,LES VALLEES,B217,79120,79336,Vançais,79,,,79336000ZL0059,,,,,,,,,,,,,0,,,,,T,terres,,,13910,0.059554,46.288811
2023-1052266,2023-10-30,000001,Vente,54088,,,LES VALLEES,B217,79120,79336,Vançais,79,,,79336000ZL0059,,,,,,,,,,,,,0,,,,,T,terres,,,13909,0.059554,46.288811
2023-1052266,2023-10-30,000001,Vente,54088,,,LES VALLEES,B217,79120,79336,Vançais,79,,,79336000ZL0059,,,,,,,,,,,,,0,,,,,T,terres,,,13909,0.059554,46.288811
2023-1052266,2023-10-30,000001,Vente,54088,,,LES VALLEES,B217,79120,79336,Vançais,79,,,79336000ZL0061,,,,,,,,,,,,,0,,,,,T,terres,,,16289,0.060149,46.290641
2023-1052266,2023-10-30,000001,Vente,54088,,,LA GRANDE VALLEE,B240,79120,79336,Vançais,79,,,79336000ZM0029,,,,,,,,,,,,,0,,,,,T,terres,,,33645,0.059048,46.286015
2023-1052266,2023-10-30,000001,Vente,54088,,,LA GRANDE VALLEE,B240,79120,79336,Vançais,79,,,79336000ZM0029,,,,,,,,,,,,,0,,,,,T,terres,,,11215,0.059048,46.286015
2023-1052753,2023-11-17,000001,Vente,1000,,,COURGE,B229,79120,79336,Vançais,79,,,79336000AB0133,,,,,,,,,,,,,0,,,,,S,sols,,,80,0.028258,46.324521
2023-1052753,2023-11-17,000001,Vente,1000,,,COURGE,B229,79120,79336,Vançais,79,,,79336000AB0134,,,,,,,,,,,,,0,,,,,T,terres,,,452,0.02834,46.324584
