id_mutation,date_mutation,numero_disposition,nature_mutation,valeur_fonciere,adresse_numero,adresse_suffixe,adresse_nom_voie,adresse_code_voie,code_postal,code_commune,nom_commune,code_departement,ancien_code_commune,ancien_nom_commune,id_parcelle,ancien_id_parcelle,numero_volume,lot1_numero,lot1_surface_carrez,lot2_numero,lot2_surface_carrez,lot3_numero,lot3_surface_carrez,lot4_numero,lot4_surface_carrez,lot5_numero,lot5_surface_carrez,nombre_lots,code_type_local,type_local,surface_reelle_bati,nombre_pieces_principales,code_nature_culture,nature_culture,code_nature_culture_speciale,nature_culture_speciale,surface_terrain,longitude,latitude
2023-1073509,2023-01-04,000001,Vente,5000,,,BREZOU,B007,82140,82061,Féneyrols,82,,,820610000C0957,,,,,,,,,,,,,0,,,,,T,terres,,,14760,1.811435,44.14834
2023-1073564,2023-01-13,000001,Vente,50,,,ROUMEGOUSE,B082,82140,82061,Féneyrols,82,,,820610000A0183,,,,,,,,,,,,,0,,,,,P,prés,,,1160,1.821733,44.167739
2023-1075133,2023-04-27,000001,Vente,270000,5130,A,BREZOU,B007,82140,82061,Féneyrols,82,,,820610000C0897,,,,,,,,,,,,,0,3,Dépendance,,0,AG,terrains d'agrément,,,500,1.805976,44.148402
2023-1075133,2023-04-27,000001,Vente,270000,5130,A,BREZOU,B007,82140,82061,Féneyrols,82,,,820610000C0897,,,,,,,,,,,,,0,1,Maison,98,4,AG,terrains d'agrément,,,500,1.805976,44.148402
2023-1075133,2023-04-27,000001,Vente,270000,5130,A,BREZOU,B007,82140,82061,Féneyrols,82,,,820610000C0897,,,,,,,,,,,,,0,3,Dépendance,,0,S,sols,,,1000,1.805976,44.148402
2023-1075133,2023-04-27,000001,Vente,270000,5130,A,BREZOU,B007,82140,82061,Féneyrols,82,,,820610000C0897,,,,,,,,,,,,,0,1,Maison,98,4,L,landes,PATUR,Pâture plantée,495,1.805976,44.148402
2023-1075133,2023-04-27,000001,Vente,270000,5130,A,BREZOU,B007,82140,82061,Féneyrols,82,,,820610000C0897,,,,,,,,,,,,,0,3,Dépendance,,0,L,landes,PATUR,Pâture plantée,495,1.805976,44.148402
2023-1075133,2023-04-27,000001,Vente,270000,5130,A,BREZOU,B007,82140,82061,Féneyrols,82,,,820610000C0897,,,,,,,,,,,,,0,1,Maison,98,4,S,sols,,,1000,1.805976,44.148402
2023-1075133,2023-04-27,000001,Vente,270000,,,BREZOU,B007,82140,82061,Féneyrols,82,,,820610000C0899,,,,,,,,,,,,,0,,,,,L,landes,PATUR,Pâture plantée,1720,1.806237,44.148864
2023-1075133,2023-04-27,000001,Vente,270000,,,BREZOU,B007,82140,82061,Féneyrols,82,,,820610000C0899,,,,,,,,,,,,,0,,,,,S,sols,,,200,1.806237,44.148864
2023-1075133,2023-04-27,000001,Vente,270000,,,BREZOU,B007,82140,82061,Féneyrols,82,,,820610000C0900,,,,,,,,,,,,,0,,,,,L,landes,FRICH,Friche,795,1.806246,44.149244
2023-1075133,2023-04-27,000001,Vente,270000,,,BREZOU,B007,82140,82061,Féneyrols,82,,,820610000C0902,,,,,,,,,,,,,0,,,,,L,landes,FRICH,Friche,650,1.806537,44.149411
2023-1075133,2023-04-27,000001,Vente,270000,,,BREZOU,B007,82140,82061,Féneyrols,82,,,820610000C1221,,,,,,,,,,,,,0,,,,,L,landes,PATUR,Pâture plantée,4570,1.805844,44.148955
2023-1076191,2023-06-30,000001,Vente,95000,,,CANTE MERLE,B011,82140,82061,Féneyrols,82,,,820610000D0028,,,,,,,,,,,,,0,,,,,P,prés,,,1340,1.810217,44.134645
2023-1076191,2023-06-30,000001,Vente,95000,,,CANTE MERLE,B011,82140,82061,Féneyrols,82,,,820610000D0047,,,,,,,,,,,,,0,,,,,BT,taillis simples,,,6390,1.812151,44.132218
2023-1076191,2023-06-30,000001,Vente,95000,,,CANTE MERLE,B011,82140,82061,Féneyrols,82,,,820610000D0048,,,,,,,,,,,,,0,,,,,BT,taillis simples,,,1025,1.81254,44.132381
2023-1076191,2023-06-30,000001,Vente,95000,,,CANTE MERLE,B011,82140,82061,Féneyrols,82,,,820610000D0052,,,,,,,,,,,,,0,,,,,P,prés,,,3300,1.811821,44.131603
2023-1076191,2023-06-30,000001,Vente,95000,,,CANTE MERLE,B011,82140,82061,Féneyrols,82,,,820610000D0055,,,,,,,,,,,,,0,,,,,BT,taillis simples,,,1585,1.811177,44.131026
2023-1076197,2023-07-07,000001,Vente,310000,5104,,CANABAL,B008,82140,82061,Féneyrols,82,,,820610000C0416,,,,,,,,,,,,,0,3,Dépendance,,0,S,sols,,,975,1.821728,44.131488
2023-1076197,2023-07-07,000001,Vente,310000,5104,,CANABAL,B008,82140,82061,Féneyrols,82,,,820610000C0416,,,,,,,,,,,,,0,1,Maison,186,7,S,sols,,,975,1.821728,44.131488
2023-1076197,2023-07-07,000001,Vente,310000,,,CANABAL,B008,82140,82061,Féneyrols,82,,,820610000C0417,,,,,,,,,,,,,0,,,,,T,terres,,,1145,1.821363,44.131538
2023-1076197,2023-07-07,000001,Vente,310000,,,CANABAL,B008,82140,82061,Féneyrols,82,,,820610000C0419,,,,,,,,,,,,,0,,,,,T,terres,,,215,1.820537,44.13159
2023-1076197,2023-07-07,000001,Vente,310000,,,CANABAL,B008,82140,82061,Féneyrols,82,,,820610000C1151,,,,,,,,,,,,,0,,,,,J,jardins,POTAG,Jardin potager,359,1.82073,44.131584
2023-1076253,2023-06-22,000001,Vente,1000,,,BAGAS,B001,82140,82061,Féneyrols,82,,,820610000B0507,,,,,,,,,,,,,0,,,,,L,landes,FRICH,Friche,7250,1.824706,44.148636
2023-1077015,2023-08-22,000002,Vente,3591.2,,,LISSARD,B049,82140,82061,Féneyrols,82,,,820610000B0688,,,,,,,,,,,,,0,,,,,T,terres,,,5680,1.841136,44.147572
2023-1077682,2023-10-04,000001,Vente,131410,5143,A,CARRANDIER,B013,82140,82061,Féneyrols,82,,,820610000A0791,,,2,,,,,,,,,,1,1,Maison,53,2,,,,,,1.834592,44.168166
2023-1077682,2023-10-04,000001,Vente,131410,,,CARRANDIER,B013,82140,82061,Féneyrols,82,,,820610000A0792,,,,,,,,,,,,,0,,,,,T,terres,,,528,1.834676,44.168171
2023-1077682,2023-10-04,000001,Vente,131410,,,CARRANDIER,B013,82140,82061,Féneyrols,82,,,820610000A0793,,,,,,,,,,,,,0,,,,,S,sols,,,5,1.83463,44.168165
2023-1077988,2023-10-11,000001,Echange,2600,,,VINAYRE,B092,82140,82061,Féneyrols,82,,,820610000B0230,,,,,,,,,,,,,0,,,,,T,terres,,,2642,1.831934,44.146202
2023-1077988,2023-10-11,000001,Echange,2600,,,VINAYRE,B092,82140,82061,Féneyrols,82,,,820610000B0245,,,,,,,,,,,,,0,,,,,T,terres,,,3054,1.831223,44.145434
2023-1077988,2023-10-11,000001,Echange,2600,,,COMBES HAUTES,B023,82140,82061,Féneyrols,82,,,820610000B0259,,,,,,,,,,,,,0,,,,,BT,taillis simples,,,180,1.831036,44.14506
2023-1077988,2023-10-11,000001,Echange,2600,5030,A,DEROUCAT,B029,82140,82061,Féneyrols,82,,,820610000B0317,,,,,,,,,,,,,0,4,Local industriel. commercial ou assimilé,,,BP,peupleraies,,,2396,1.836401,44.144279
2023-1077988,2023-10-11,000001,Echange,2600,5030,A,DEROUCAT,B029,82140,82061,Féneyrols,82,,,820610000B0317,,,,,,,,,,,,,0,4,Local industriel. commercial ou assimilé,,,BP,peupleraies,,,2396,1.836401,44.144279
2023-1077988,2023-10-11,000001,Echange,2600,,,DEROUCAT,B029,82140,82061,Féneyrols,82,,,820610000B0323,,,,,,,,,,,,,0,,,,,BT,taillis simples,,,1606,1.835068,44.143361
2023-1077988,2023-10-11,000001,Echange,2600,,,DEROUCAT,B029,82140,82061,Féneyrols,82,,,820610000B0326,,,,,,,,,,,,,0,,,,,BP,peupleraies,,,1020,1.834843,44.143029
2023-1077988,2023-10-11,000001,Echange,2600,,,DEROUCAT,B029,82140,82061,Féneyrols,82,,,820610000B0720,,,,,,,,,,,,,0,,,,,BT,taillis simples,,,980,1.836103,44.144092
2023-1077989,2023-10-11,000002,Echange,1710,,,VINAYRE,B092,82140,82061,Féneyrols,82,,,820610000B0233,,,,,,,,,,,,,0,,,,,T,terres,,,6569,1.829638,44.146647
2023-1077990,2023-10-11,000003,Echange,890,,,VINAYRE,B092,82140,82061,Féneyrols,82,,,820610000B0234,,,,,,,,,,,,,0,,,,,P,prés,,,1460,1.828292,44.146626
2023-1077990,2023-10-11,000003,Echange,890,,,VINAYRE,B092,82140,82061,Féneyrols,82,,,820610000B0236,,,,,,,,,,,,,0,,,,,P,prés,,,1780,1.828599,44.146167
2023-1077990,2023-10-11,000003,Echange,890,,,VINAYRE,B092,82140,82061,Féneyrols,82,,,820610000B0238,,,,,,,,,,,,,0,,,,,L,landes,FRICH,Friche,1003,1.828007,44.146251
2023-1077990,2023-10-11,000003,Echange,890,,,VINAYRE,B092,82140,82061,Féneyrols,82,,,820610000B0701,,,,,,,,,,,,,0,,,,,P,prés,,,277,1.829085,44.146194
2023-1077990,2023-10-11,000003,Echange,890,,,VINAYRE,B092,82140,82061,Féneyrols,82,,,820610000B0706,,,,,,,,,,,,,0,,,,,S,sols,,,20,1.82784,44.146434
2023-1078470,2023-11-14,000001,Vente,3000,,,PECH DAUMET,B060,82140,82061,Féneyrols,82,,,820610000D0456,,,,,,,,,,,,,0,,,,,L,landes,FRICH,Friche,3281,1.82133,44.127622
2023-1078470,2023-11-14,000001,Vente,3000,,,PECH DAUMET,B060,82140,82061,Féneyrols,82,,,820610000D0458,,,,,,,,,,,,,0,,,,,L,landes,FRICH,Friche,2049,1.821566,44.127921
2023-1078785,2023-12-05,000001,Vente,14600,,,CANABAL,B008,82140,82061,Féneyrols,82,,,820610000C0421,,,,,,,,,,,,,0,,,,,S,sols,,,475,1.820591,44.131932
2023-1078785,2023-12-05,000001,Vente,14600,,,CANABAL,B008,82140,82061,Féneyrols,82,,,820610000C0422,,,,,,,,,,,,,0,,,,,T,terres,,,797,1.820641,44.131956
2023-1078815,2023-12-08,000001,Vente,55000,,,VILLAGE,B091,82140,82061,Féneyrols,82,,,820610000C0005,,,,,,,,,,,,,0,,,,,S,sols,,,80,1.81926,44.131029
2023-1078815,2023-12-08,000001,Vente,55000,5043,,VILLAGE,B091,82140,82061,Féneyrols,82,,,820610000C0006,,,,,,,,,,,,,0,1,Maison,32,1,S,sols,,,38,1.819302,44.131072
