id_mutation,date_mutation,numero_disposition,nature_mutation,valeur_fonciere,adresse_numero,adresse_suffixe,adresse_nom_voie,adresse_code_voie,code_postal,code_commune,nom_commune,code_departement,ancien_code_commune,ancien_nom_commune,id_parcelle,ancien_id_parcelle,numero_volume,lot1_numero,lot1_surface_carrez,lot2_numero,lot2_surface_carrez,lot3_numero,lot3_surface_carrez,lot4_numero,lot4_surface_carrez,lot5_numero,lot5_surface_carrez,nombre_lots,code_type_local,type_local,surface_reelle_bati,nombre_pieces_principales,code_nature_culture,nature_culture,code_nature_culture_speciale,nature_culture_speciale,surface_terrain,longitude,latitude
2023-1074050,2023-02-13,000001,Vente,700,,,CAPEL,B032,82190,82084,Lacour,82,,,820840000C0263,,,,,,,,,,,,,0,,,,,BT,taillis simples,,,2451,0.99186,44.277287
2023-1074050,2023-02-13,000001,Vente,700,,,CAPEL,B032,82190,82084,Lacour,82,,,820840000C0267,,,,,,,,,,,,,0,,,,,BT,taillis simples,,,2348,0.990797,44.278522
2023-1074587,2023-03-17,000001,Vente,335510,,,HAMEAU DE MESTRE,B058,82190,82084,Lacour,82,,,820840000E0621,,,,,,,,,,,,,0,,,,,P,prés,,,2759,0.936139,44.291308
2023-1074587,2023-03-17,000001,Vente,335510,,,HAMEAU DE MESTRE,B058,82190,82084,Lacour,82,,,820840000E0621,,,,,,,,,,,,,0,,,,,S,sols,,,858,0.936139,44.291308
2023-1074587,2023-03-17,000001,Vente,335510,5067,,HAMEAU DE MESTRE,B058,82190,82084,Lacour,82,,,820840000E0622,,,,,,,,,,,,,0,3,Dépendance,,0,S,sols,,,1550,0.935867,44.291155
2023-1074587,2023-03-17,000001,Vente,335510,5067,,HAMEAU DE MESTRE,B058,82190,82084,Lacour,82,,,820840000E0622,,,,,,,,,,,,,0,3,Dépendance,,0,S,sols,,,1550,0.935867,44.291155
2023-1074587,2023-03-17,000001,Vente,335510,5067,,HAMEAU DE MESTRE,B058,82190,82084,Lacour,82,,,820840000E0622,,,,,,,,,,,,,0,3,Dépendance,,0,S,sols,,,1550,0.935867,44.291155
2023-1074587,2023-03-17,000001,Vente,335510,5067,,HAMEAU DE MESTRE,B058,82190,82084,Lacour,82,,,820840000E0622,,,,,,,,,,,,,0,1,Maison,105,4,S,sols,,,1550,0.935867,44.291155
2023-1074587,2023-03-17,000001,Vente,335510,,,HAMEAU DE MESTRE,B058,82190,82084,Lacour,82,,,820840000E0765,,,,,,,,,,,,,0,,,,,L,landes,PATUR,Pâture plantée,362,0.935934,44.291181
2023-1074724,2023-03-21,000001,Vente,350000,5101,,FLAJAL,B048,82190,82084,Lacour,82,,,820840000D0604,,,,,,,,,,,,,0,1,Maison,150,6,S,sols,,,1564,0.952651,44.274593
2023-1074724,2023-03-21,000001,Vente,350000,5101,,FLAJAL,B048,82190,82084,Lacour,82,,,820840000D0604,,,,,,,,,,,,,0,3,Dépendance,,0,S,sols,,,1564,0.952651,44.274593
2023-1074724,2023-03-21,000001,Vente,350000,5101,,FLAJAL,B048,82190,82084,Lacour,82,,,820840000D0604,,,,,,,,,,,,,0,3,Dépendance,,0,S,sols,,,1564,0.952651,44.274593
2023-1074724,2023-03-21,000001,Vente,350000,,,FLAJAL,B048,82190,82084,Lacour,82,,,820840000D0607,,,,,,,,,,,,,0,,,,,T,terres,,,1180,0.953096,44.274621
2023-1074724,2023-03-21,000001,Vente,350000,,,FLAJAL,B048,82190,82084,Lacour,82,,,820840000D0699,,,,,,,,,,,,,0,,,,,T,terres,,,571,0.952776,44.274341
2023-1074724,2023-03-21,000001,Vente,350000,,,FLAJAL,B048,82190,82084,Lacour,82,,,820840000D0702,,,,,,,,,,,,,0,,,,,T,terres,,,243,0.953033,44.274809
2023-1075527,2023-05-22,000001,Vente,1100,,,CAPEL,B032,82190,82084,Lacour,82,,,820840000C0257,,,,,,,,,,,,,0,,,,,BT,taillis simples,,,8020,0.994308,44.275686
2023-1075527,2023-05-22,000001,Vente,1100,,,CAPEL,B032,82190,82084,Lacour,82,,,820840000C0264,,,,,,,,,,,,,0,,,,,BT,taillis simples,,,1242,0.9917,44.277493
2023-1075528,2023-05-22,000002,Vente,300,,,CAPEL,B032,82190,82084,Lacour,82,,,820840000C0268,,,,,,,,,,,,,0,,,,,BT,taillis simples,,,2025,0.990646,44.278632
2023-1076559,2023-07-26,000001,Vente,2300,,,LE CAMPET,B029,82190,82084,Lacour,82,,,820840000C0651,,,,,,,,,,,,,0,,,,,T,terres,,,2979,0.975206,44.282612
2023-1076559,2023-07-26,000001,Vente,2300,,,LE CAMPET,B029,82190,82084,Lacour,82,,,820840000C0656,,,,,,,,,,,,,0,,,,,T,terres,,,2504,0.97566,44.283618
2023-1076560,2023-07-26,000002,Vente,4300,,,CAUSSE,B036,82190,82084,Lacour,82,,,820840000C0686,,,,,,,,,,,,,0,,,,,T,terres,,,9734,0.97768,44.27872
2023-1076610,2023-07-20,000001,Vente,8000,,,CAMP DE NOTRE DAME,B027,82190,82084,Lacour,82,,,820840000C0383,,,,,,,,,,,,,0,,,,,T,terres,,,13182,0.983478,44.285652
2023-1076610,2023-07-20,000001,Vente,8000,,,CAMP DE NOTRE DAME,B027,82190,82084,Lacour,82,,,820840000C0386,,,,,,,,,,,,,0,,,,,T,terres,,,3849,0.982561,44.28519
2023-1076610,2023-07-20,000001,Vente,8000,,,CAMP DE NOTRE DAME,B027,82190,82084,Lacour,82,,,820840000C0388,,,,,,,,,,,,,0,,,,,BT,taillis simples,,,308,0.982099,44.285436
2023-1076610,2023-07-20,000001,Vente,8000,,,CAMP DE NOTRE DAME,B027,82190,82084,Lacour,82,,,820840000C0390,,,,,,,,,,,,,0,,,,,BT,taillis simples,,,2200,0.982233,44.286492
2023-1077351,2023-09-15,000001,Vente,246450,6,,RUE DE LA MAIRIE,0060,82190,82084,Lacour,82,,,820840000E0511,,,,,,,,,,,,,0,3,Dépendance,,0,S,sols,,,657,0.944918,44.291042
2023-1077351,2023-09-15,000001,Vente,246450,6,,RUE DE LA MAIRIE,0060,82190,82084,Lacour,82,,,820840000E0511,,,,,,,,,,,,,0,1,Maison,120,4,S,sols,,,657,0.944918,44.291042
2023-1077351,2023-09-15,000001,Vente,246450,,,LACOUR,B061,82190,82084,Lacour,82,,,820840000E0538,,,,,,,,,,,,,0,,,,,L,landes,FRICH,Friche,329,0.944733,44.291297
2023-1077378,2023-09-05,000001,Vente,577025,,,LAUSSURE,B068,82190,82084,Lacour,82,,,820840000D0403,,,,,,,,,,,,,0,,,,,L,landes,PATUR,Pâture plantée,3740,0.964821,44.284194
2023-1077378,2023-09-05,000001,Vente,577025,,,LAUSSURE,B068,82190,82084,Lacour,82,,,820840000D0432,,,,,,,,,,,,,0,,,,,BT,taillis simples,,,6670,0.963014,44.283776
2023-1077378,2023-09-05,000001,Vente,577025,,,LAUSSURE,B068,82190,82084,Lacour,82,,,820840000D0433,,,,,,,,,,,,,0,,,,,L,landes,FRICH,Friche,3296,0.963816,44.283992
2023-1077378,2023-09-05,000001,Vente,577025,,,LAUSSURE,B068,82190,82084,Lacour,82,,,820840000D0434,,,,,,,,,,,,,0,,,,,L,landes,FRICH,Friche,978,0.964237,44.28385
2023-1077378,2023-09-05,000001,Vente,577025,5058,,LAUSSURE,B068,82190,82084,Lacour,82,,,820840000D0435,,,,,,,,,,,,,0,3,Dépendance,,0,S,sols,,,2940,0.965077,44.283801
2023-1077378,2023-09-05,000001,Vente,577025,5058,,LAUSSURE,B068,82190,82084,Lacour,82,,,820840000D0435,,,,,,,,,,,,,0,3,Dépendance,,0,S,sols,,,2940,0.965077,44.283801
2023-1077378,2023-09-05,000001,Vente,577025,5058,,LAUSSURE,B068,82190,82084,Lacour,82,,,820840000D0435,,,,,,,,,,,,,0,3,Dépendance,,0,S,sols,,,2940,0.965077,44.283801
2023-1077378,2023-09-05,000001,Vente,577025,5058,,LAUSSURE,B068,82190,82084,Lacour,82,,,820840000D0435,,,,,,,,,,,,,0,3,Dépendance,,0,S,sols,,,2940,0.965077,44.283801
2023-1077378,2023-09-05,000001,Vente,577025,5058,,LAUSSURE,B068,82190,82084,Lacour,82,,,820840000D0435,,,,,,,,,,,,,0,1,Maison,55,2,S,sols,,,2940,0.965077,44.283801
2023-1077378,2023-09-05,000001,Vente,577025,5058,,LAUSSURE,B068,82190,82084,Lacour,82,,,820840000D0435,,,,,,,,,,,,,0,1,Maison,80,2,S,sols,,,2940,0.965077,44.283801
2023-1077378,2023-09-05,000001,Vente,577025,5058,,LAUSSURE,B068,82190,82084,Lacour,82,,,820840000D0435,,,,,,,,,,,,,0,1,Maison,102,2,S,sols,,,2940,0.965077,44.283801
2023-1077853,2023-09-29,000001,Vente,213300,,,LACOUR,B061,82190,82084,Lacour,82,,,820840000E0474,,,,,,,,,,,,,0,,,,,S,sols,,,90,0.946966,44.291752
2023-1077853,2023-09-29,000001,Vente,213300,10,,RUE GRANDE RUE,0030,82190,82084,Lacour,82,,,820840000E0475,,,,,,,,,,,,,0,1,Maison,100,3,S,sols,,,448,0.947022,44.291823
2023-1077854,2023-10-02,000001,Vente,6735.42,,,SAINT JULIEN,B116,82190,82084,Lacour,82,,,820840000C0985,,,,,,,,,,,,,0,,,,,L,landes,FRICH,Friche,230,0.971211,44.271128
2023-1077854,2023-10-02,000001,Vente,6735.42,,,BOUSQUET,B015,82190,82084,Lacour,82,,,820840000C0989,,,,,,,,,,,,,0,,,,,BT,taillis simples,,,931,0.970709,44.271865
2023-1077854,2023-10-02,000001,Vente,6735.42,,,BOUSQUET,B015,82190,82084,Lacour,82,,,820840000C0994,,,,,,,,,,,,,0,,,,,BT,taillis simples,,,355,0.969484,44.27209
2023-1077854,2023-10-02,000001,Vente,6735.42,,,BOUSQUET,B015,82190,82084,Lacour,82,,,820840000C0995,,,,,,,,,,,,,0,,,,,BT,taillis simples,,,23430,0.968013,44.271996
2023-1077868,2023-10-12,000001,Vente,75000,5050,,LAUSINIE,B066,82190,82084,Lacour,82,,,820840000D0103,,,,,,,,,,,,,0,1,Maison,88,5,S,sols,,,1060,0.949301,44.27863
2023-1077868,2023-10-12,000001,Vente,75000,,,LAUSINIE,B066,82190,82084,Lacour,82,,,820840000D0104,,,,,,,,,,,,,0,,,,,T,terres,,,85,0.949442,44.278763
2023-1077868,2023-10-12,000001,Vente,75000,,,LAUSINIE,B066,82190,82084,Lacour,82,,,820840000D0106,,,,,,,,,,,,,0,,,,,T,terres,,,3882,0.949221,44.27815
2023-1077868,2023-10-12,000001,Vente,75000,,,LAUSINIE,B066,82190,82084,Lacour,82,,,820840000D0107,,,,,,,,,,,,,0,,,,,T,terres,,,3590,0.949747,44.277069
2023-1077868,2023-10-12,000001,Vente,75000,,,LAUSINIE,B066,82190,82084,Lacour,82,,,820840000D0108,,,,,,,,,,,,,0,,,,,T,terres,,,870,0.949537,44.277832
2023-1077868,2023-10-12,000001,Vente,75000,,,LAUSINIE,B066,82190,82084,Lacour,82,,,820840000D0109,,,,,,,,,,,,,0,,,,,T,terres,,,4119,0.949807,44.277628
2023-1077868,2023-10-12,000001,Vente,75000,,,LAUSINIE,B066,82190,82084,Lacour,82,,,820840000D0739,,,,,,,,,,,,,0,,,,,T,terres,,,561,0.949133,44.278739
2023-1077868,2023-10-12,000001,Vente,75000,,,LAUSINIE,B066,82190,82084,Lacour,82,,,820840000D0741,,,,,,,,,,,,,0,,,,,T,terres,,,1409,0.950224,44.276598
2023-1078224,2023-11-10,000001,Vente,700,,,CANTECOUCUT,B030,82190,82084,Lacour,82,,,820840000C0162,,,,,,,,,,,,,0,,,,,BT,taillis simples,,,5556,0.990076,44.283747
2023-1078950,2023-12-15,000001,Vente,420000,,,LABOUISSEL,B060,82190,82084,Lacour,82,,,820840000E0037,,,,,,,,,,,,,0,,,,,T,terres,,,2370,0.934079,44.292515
2023-1078950,2023-12-15,000001,Vente,420000,,,LABOUISSEL,B060,82190,82084,Lacour,82,,,820840000E0038,,,,,,,,,,,,,0,,,,,BT,taillis simples,,,415,0.933961,44.292836
2023-1078950,2023-12-15,000001,Vente,420000,,,LABOUISSEL,B060,82190,82084,Lacour,82,,,820840000E0039,,,,,,,,,,,,,0,,,,,L,landes,FRICH,Friche,702,0.934316,44.292664
2023-1078950,2023-12-15,000001,Vente,420000,,,MESTRE-HAUT,B074,82190,82084,Lacour,82,,,820840000E0338,,,,,,,,,,,,,0,,,,,L,landes,FRICH,Friche,5259,0.933718,44.292282
2023-1078950,2023-12-15,000001,Vente,420000,,,LABOUISSEL,B060,82190,82084,Lacour,82,,,820840000E0566,,,,,,,,,,,,,0,,,,,L,landes,PATUR,Pâture plantée,1146,0.934298,44.2931
2023-1078950,2023-12-15,000001,Vente,420000,,,LABOUISSEL,B060,82190,82084,Lacour,82,,,820840000E0569,,,,,,,,,,,,,0,,,,,L,landes,PATUR,Pâture plantée,1702,0.934742,44.292635
2023-1078950,2023-12-15,000001,Vente,420000,,,LABOUISSEL,B060,82190,82084,Lacour,82,,,820840000E0611,,,,,,,,,,,,,0,,,,,L,landes,PATUR,Pâture plantée,106,0.933676,44.293532
2023-1078950,2023-12-15,000001,Vente,420000,,,LABOUISSEL,B060,82190,82084,Lacour,82,,,820840000E0748,,,,,,,,,,,,,0,,,,,L,landes,FRICH,Friche,273,0.932602,44.293969
2023-1078950,2023-12-15,000001,Vente,420000,,,MESTRE-HAUT,B074,82190,82084,Lacour,82,,,820840000E0749,,,,,,,,,,,,,0,,,,,L,landes,FRICH,Friche,8,0.933221,44.293696
2023-1078950,2023-12-15,000001,Vente,420000,,,MESTRE-HAUT,B074,82190,82084,Lacour,82,,,820840000E0751,,,,,,,,,,,,,0,,,,,L,landes,FRICH,Friche,3366,0.932223,44.293642
2023-1078950,2023-12-15,000001,Vente,420000,,,LABOUISSEL,B060,82190,82084,Lacour,82,,,820840000E0753,,,,,,,,,,,,,0,,,,,L,landes,PATUR,Pâture plantée,7405,0.933325,44.293005
2023-1078950,2023-12-15,000001,Vente,420000,5061,,LABOUISSEL,B060,82190,82084,Lacour,82,,,820840000E0759,,,,,,,,,,,,,0,3,Dépendance,,0,S,sols,,,2758,0.93399,44.293283
2023-1078950,2023-12-15,000001,Vente,420000,5061,,LABOUISSEL,B060,82190,82084,Lacour,82,,,820840000E0759,,,,,,,,,,,,,0,3,Dépendance,,0,S,sols,,,2758,0.93399,44.293283
2023-1078950,2023-12-15,000001,Vente,420000,5061,,LABOUISSEL,B060,82190,82084,Lacour,82,,,820840000E0759,,,,,,,,,,,,,0,1,Maison,94,2,S,sols,,,2758,0.93399,44.293283
2023-1078950,2023-12-15,000001,Vente,420000,5061,,LABOUISSEL,B060,82190,82084,Lacour,82,,,820840000E0759,,,,,,,,,,,,,0,3,Dépendance,,0,S,sols,,,2758,0.93399,44.293283
2023-1078950,2023-12-15,000001,Vente,420000,,,HAMEAU DE MESTRE,B058,82190,82084,Lacour,82,,,820840000E0760,,,,,,,,,,,,,0,,,,,L,landes,PATUR,Pâture plantée,231,0.932569,44.293923
2023-1078950,2023-12-15,000001,Vente,420000,,,HAMEAU DE MESTRE,B058,82190,82084,Lacour,82,,,820840000E0763,,,,,,,,,,,,,0,,,,,L,landes,PATUR,Pâture plantée,541,0.933958,44.29305
